flagflag  If you want to see English page, please click "English" Button at Left.

Re: Please ask a question in easy English.

このトピックの投稿一覧へ

なし Re: Please ask a question in easy English.

msg# 1.16
depth:
1
前の投稿 - 次の投稿 | 親投稿 - 子投稿.1 | 投稿日時 2013-7-11 18:51
fcassola  Not too shy to talk 居住地: Porto :: Portugal  投稿数: 24
Iseki, thanks for your help.
I use the most recent source code, and my vs2010 is the professional one ...
Ive found errors on compiling, particularly on the link modules, here is the compilation window ...
SORRY for the inconvinience!

1>------ Rebuild All started: Project: Rinions, Configuration: Debug Win32 ------
1>Build started 11/07/2013 10:12:01.
1>_PrepareForClean:
1> Deleting file "Debug\Rinions.lastbuildstate".
1>InitializeBuildStatus:
1> Touching "Debug\Rinions.unsuccessfulbuild".
1>ClCompile:
1> stdafx.cpp
1> SHMJoints.cpp
1> SHMIF.cpp
1> CameraView.cpp
1>c:\users\media markt\documents\visual studio 2010\projects\rinions\junkbox_lib++\graphlib\gio.h(449): warning C4129: '' : unrecognized character escape sequence
1> SensorFrame.cpp
1>c:\users\media markt\documents\visual studio 2010\projects\rinions\junkbox_lib++\graphlib\gio.h(449): warning C4129: '' : unrecognized character escape sequence
1> Rinions.cpp
1>c:\users\media markt\documents\visual studio 2010\projects\rinions\junkbox_lib++\graphlib\gio.h(449): warning C4129: '' : unrecognized character escape sequence
1> ParameterSet.cpp
1> MainFrm.cpp
1>c:\users\media markt\documents\visual studio 2010\projects\rinions\junkbox_lib++\graphlib\gio.h(449): warning C4129: '' : unrecognized character escape sequence
1> ExportNiData.cpp
1> ExOpenNiWin.cpp
1>c:\users\media markt\documents\visual studio 2010\projects\rinions\junkbox_lib++\graphlib\gio.h(449): warning C4129: '' : unrecognized character escape sequence
1> ExNiSHMemory.cpp
1>c:\users\media markt\documents\visual studio 2010\projects\rinions\junkbox_lib++\graphlib\gio.h(449): warning C4129: '' : unrecognized character escape sequence
1> ExNiNetwork.cpp
1> ExNiJoints.cpp
1> ExNiFileDev.cpp
1> ExNiDevice.cpp
1>c:\users\media markt\documents\visual studio 2010\projects\rinions\junkbox_lib++\graphlib\gio.h(449): warning C4129: '' : unrecognized character escape sequence
1> ExKinectWin.cpp
1>c:\users\media markt\documents\visual studio 2010\projects\rinions\junkbox_lib++\graphlib\gio.h(449): warning C4129: '' : unrecognized character escape sequence
1> SetViewMode.cpp
1> SetSpeech.cpp
1> SetOutData.cpp
1> SetNetwork.cpp
1> SetMotion.cpp
1> Generating Code...
1> Compiling...
1> SetLogMode.cpp
1> SetDevice.cpp
1>c:\users\media markt\documents\visual studio 2010\projects\rinions\junkbox_lib++\graphlib\gio.h(449): warning C4129: '' : unrecognized character escape sequence
1> SetDataSave.cpp
1>c:\users\media markt\documents\visual studio 2010\projects\rinions\junkbox_lib++\graphlib\gio.h(449): warning C4129: '' : unrecognized character escape sequence
1> SetAnimation.cpp
1>c:\users\media markt\documents\visual studio 2010\projects\rinions\junkbox_lib++\graphlib\gio.h(449): warning C4129: '' : unrecognized character escape sequence
1> FilePlayerDLG.cpp
1>c:\users\media markt\documents\visual studio 2010\projects\rinions\junkbox_lib++\graphlib\gio.h(449): warning C4129: '' : unrecognized character escape sequence
1> DepthFrame.cpp
1>c:\users\media markt\documents\visual studio 2010\projects\rinions\junkbox_lib++\graphlib\gio.h(449): warning C4129: '' : unrecognized character escape sequence
1> Generating Code...
1>NiTE2.lib : warning LNK4003: invalid library format; library ignored
1>opencv_core242d.lib : warning LNK4003: invalid library format; library ignored
1>opencv_imgproc242d.lib : warning LNK4003: invalid library format; library ignored
1>opencv_objdetect242d.lib : warning LNK4003: invalid library format; library ignored
1>zlibd.lib : warning LNK4003: invalid library format; library ignored
1>NiTE2.lib : warning LNK4003: invalid library format; library ignored
1>opencv_core242d.lib : warning LNK4003: invalid library format; library ignored
1>opencv_imgproc242d.lib : warning LNK4003: invalid library format; library ignored
1>opencv_objdetect242d.lib : warning LNK4003: invalid library format; library ignored
1>zlibd.lib : warning LNK4003: invalid library format; library ignored
1>LINK : warning LNK4199: /DELAYLOAD:OpenNI.dll ignored; no imports found from OpenNI.dll
1>LINK : warning LNK4199: /DELAYLOAD:NiTE2.dll ignored; no imports found from NiTE2.dll
1>ExNiJoints.obj : error LNK2019: unresolved external symbol "public: virtual __thiscall cv::CascadeClassifier::~CascadeClassifier(void)" (??1CascadeClassifier@cv@@UAE@XZ) referenced in function __unwindfunclet$??0CExNiJoints@jbxwl@@QAE@XZ$0
1>ExNiJoints.obj : error LNK2019: unresolved external symbol "public: __thiscall cv::CascadeClassifier::CascadeClassifier(void)" (??0CascadeClassifier@cv@@QAE@XZ) referenced in function "public: __thiscall jbxwl::CExNiJoints::CExNiJoints(void)" (??0CExNiJoints@jbxwl@@QAE@XZ)
1>ExNiJoints.obj : error LNK2019: unresolved external symbol "public: bool __thiscall cv::CascadeClassifier::load(class std::basic_string<char,struct std::char_traits<char>,class std::allocator<char> > const &)" (?load@CascadeClassifier@cv@@QAE_NABV?$basic_string@DU?$char_traits@D@std@@V?$allocator@D@2@@std@@@Z) referenced in function "public: int __thiscall jbxwl::CExNiJoints::init_opencv(void)" (?init_opencv@CExNiJoints@jbxwl@@QAEHXZ)
1>ExNiJoints.obj : error LNK2001: unresolved external symbol "public: virtual bool __thiscall cv::CascadeClassifier::empty(void)const " (?empty@CascadeClassifier@cv@@UBE_NXZ)
1>ExNiJoints.obj : error LNK2001: unresolved external symbol "public: virtual bool __thiscall cv::CascadeClassifier::read(class cv::FileNode const &)" (?read@CascadeClassifier@cv@@UAE_NABVFileNode@2@@Z)
1>ExNiJoints.obj : error LNK2001: unresolved external symbol "public: virtual void __thiscall cv::CascadeClassifier::detectMultiScale(class cv::Mat const &,class std::vector<class cv::Rect_<int>,class std::allocator<class cv::Rect_<int> > > &,class std::vector<int,class std::allocator<int> > &,class std::vector<double,class std::allocator<double> > &,double,int,int,class cv::Size_<int>,class cv::Size_<int>,bool)" (?detectMultiScale@CascadeClassifier@cv@@UAEXABVMat@2@AAV?$vector@V?$Rect_@H@cv@@V?$allocator@V?$Rect_@H@cv@@@std@@@std@@AAV?$vector@HV?$allocator@H@std@@@5@AAV?$vector@NV?$allocator@N@std@@@5@NHHV?$Size_@H@2@4_N@Z)
1>ExNiJoints.obj : error LNK2001: unresolved external symbol "public: virtual void __thiscall cv::CascadeClassifier::detectMultiScale(class cv::Mat const &,class std::vector<class cv::Rect_<int>,class std::allocator<class cv::Rect_<int> > > &,double,int,int,class cv::Size_<int>,class cv::Size_<int>)" (?detectMultiScale@CascadeClassifier@cv@@UAEXABVMat@2@AAV?$vector@V?$Rect_@H@cv@@V?$allocator@V?$Rect_@H@cv@@@std@@@std@@NHHV?$Size_@H@2@2@Z)
1>ExNiJoints.obj : error LNK2001: unresolved external symbol "public: virtual class cv::Size_<int> __thiscall cv::CascadeClassifier::getOriginalWindowSize(void)const " (?getOriginalWindowSize@CascadeClassifier@cv@@UBE?AV?$Size_@H@2@XZ)
1>ExNiJoints.obj : error LNK2001: unresolved external symbol "protected: virtual bool __thiscall cv::CascadeClassifier::detectSingleScale(class cv::Mat const &,int,class cv::Size_<int>,int,int,double,class std::vector<class cv::Rect_<int>,class std::allocator<class cv::Rect_<int> > > &,class std::vector<int,class std::allocator<int> > &,class std::vector<double,class std::allocator<double> > &,bool)" (?detectSingleScale@CascadeClassifier@cv@@MAE_NABVMat@2@HV?$Size_@H@2@HHNAAV?$vector@V?$Rect_@H@cv@@V?$allocator@V?$Rect_@H@cv@@@std@@@std@@AAV?$vector@HV?$allocator@H@std@@@6@AAV?$vector@NV?$allocator@N@std@@@6@_N@Z)
1>ExNiJoints.obj : error LNK2001: unresolved external symbol "protected: virtual int __thiscall cv::CascadeClassifier::runAt(class cv::Ptr<class cv::FeatureEvaluator> &,class cv::Point_<int>,double &)" (?runAt@CascadeClassifier@cv@@MAEHAAV?$Ptr@VFeatureEvaluator@cv@@@2@V?$Point_@H@2@AAN@Z)
1>ExNiJoints.obj : error LNK2019: unresolved external symbol "void __cdecl cv::resize(class cv::_InputArray const &,class cv::_OutputArray const &,class cv::Size_<int>,double,double,int)" (?resize@cv@@YAXABV_InputArray@1@ABV_OutputArray@1@V?$Size_@H@1@NNH@Z) referenced in function "struct _rectangle * __cdecl jbxl::cvDetectObjects<unsigned char>(class cv::CascadeClassifier,class jbxl::MSGraph<unsigned char> *,int &,int,double)" (??$cvDetectObjects@E@jbxl@@YAPAU_rectangle@@VCascadeClassifier@cv@@PAV?$MSGraph@E@0@AAHHN@Z)
1>ExNiJoints.obj : error LNK2019: unresolved external symbol "void __cdecl cv::equalizeHist(class cv::_InputArray const &,class cv::_OutputArray const &)" (?equalizeHist@cv@@YAXABV_InputArray@1@ABV_OutputArray@1@@Z) referenced in function "struct _rectangle * __cdecl jbxl::cvDetectObjects<unsigned char>(class cv::CascadeClassifier,class jbxl::MSGraph<unsigned char> *,int &,int,double)" (??$cvDetectObjects@E@jbxl@@YAPAU_rectangle@@VCascadeClassifier@cv@@PAV?$MSGraph@E@0@AAHHN@Z)
1>ExNiJoints.obj : error LNK2019: unresolved external symbol "public: __thiscall cv::_InputArray::_InputArray(class cv::Mat const &)" (??0_InputArray@cv@@QAE@ABVMat@1@@Z) referenced in function "struct _rectangle * __cdecl jbxl::cvDetectObjects<unsigned char>(class cv::CascadeClassifier,class jbxl::MSGraph<unsigned char> *,int &,int,double)" (??$cvDetectObjects@E@jbxl@@YAPAU_rectangle@@VCascadeClassifier@cv@@PAV?$MSGraph@E@0@AAHHN@Z)
1>ExNiJoints.obj : error LNK2019: unresolved external symbol "public: __thiscall cv::_OutputArray::_OutputArray(class cv::Mat &)" (??0_OutputArray@cv@@QAE@AAVMat@1@@Z) referenced in function "struct _rectangle * __cdecl jbxl::cvDetectObjects<unsigned char>(class cv::CascadeClassifier,class jbxl::MSGraph<unsigned char> *,int &,int,double)" (??$cvDetectObjects@E@jbxl@@YAPAU_rectangle@@VCascadeClassifier@cv@@PAV?$MSGraph@E@0@AAHHN@Z)
1>ExNiJoints.obj : error LNK2019: unresolved external symbol "public: void __thiscall cv::Mat::copySize(class cv::Mat const &)" (?copySize@Mat@cv@@QAEXABV12@@Z) referenced in function "public: __thiscall cv::Mat::Mat(class cv::Mat const &)" (??0Mat@cv@@QAE@ABV01@@Z)
1>ExNiJoints.obj : error LNK2019: unresolved external symbol "int __cdecl cv::_interlockedExchangeAdd(int *,int)" (?_interlockedExchangeAdd@cv@@YAHPAHH@Z) referenced in function "public: __thiscall cv::Mat::Mat(class cv::Mat const &)" (??0Mat@cv@@QAE@ABV01@@Z)
1>ExNiJoints.obj : error LNK2019: unresolved external symbol "void __cdecl cv::fastFree(void *)" (?fastFree@cv@@YAXPAX@Z) referenced in function "public: __thiscall cv::Mat::~Mat(void)" (??1Mat@cv@@QAE@XZ)
1>ExNiJoints.obj : error LNK2019: unresolved external symbol "public: void __thiscall cv::Mat::deallocate(void)" (?deallocate@Mat@cv@@QAEXXZ) referenced in function "public: void __thiscall cv::Mat::release(void)" (?release@Mat@cv@@QAEXXZ)
1>ExNiJoints.obj : error LNK2019: unresolved external symbol "public: virtual __thiscall cv::Exception::~Exception(void)" (??1Exception@cv@@UAE@XZ) referenced in function "public: class cv::Size_<int> __thiscall cv::Mat::MSize::operator()(void)const " (??RMSize@Mat@cv@@QBE?AV?$Size_@H@2@XZ)
1>ExNiJoints.obj : error LNK2019: unresolved external symbol "void __cdecl cv::error(class cv::Exception const &)" (?error@cv@@YAXABVException@1@@Z) referenced in function "public: class cv::Size_<int> __thiscall cv::Mat::MSize::operator()(void)const " (??RMSize@Mat@cv@@QBE?AV?$Size_@H@2@XZ)
1>ExNiJoints.obj : error LNK2019: unresolved external symbol "public: __thiscall cv::Exception::Exception(int,class std::basic_string<char,struct std::char_traits<char>,class std::allocator<char> > const &,class std::basic_string<char,struct std::char_traits<char>,class std::allocator<char> > const &,class std::basic_string<char,struct std::char_traits<char>,class std::allocator<char> > const &,int)" (??0Exception@cv@@QAE@HABV?$basic_string@DU?$char_traits@D@std@@V?$allocator@D@2@@std@@00H@Z) referenced in function "public: class cv::Size_<int> __thiscall cv::Mat::MSize::operator()(void)const " (??RMSize@Mat@cv@@QBE?AV?$Size_@H@2@XZ)
1>ExNiJoints.obj : error LNK2019: unresolved external symbol "public: void __thiscall cv::Ptr<struct CvHaarClassifierCascade>::delete_obj(void)" (?delete_obj@?$Ptr@UCvHaarClassifierCascade@@@cv@@QAEXXZ) referenced in function "public: void __thiscall cv::Ptr<struct CvHaarClassifierCascade>::release(void)" (?release@?$Ptr@UCvHaarClassifierCascade@@@cv@@QAEXXZ)
1>ExNiJoints.obj : error LNK2019: unresolved external symbol "public: void __thiscall cv::Mat::create(int,int const *,int)" (?create@Mat@cv@@QAEXHPBHH@Z) referenced in function "public: void __thiscall cv::Mat::create(int,int,int)" (?create@Mat@cv@@QAEXHHH@Z)
1>JunkBox_Win_Lib.lib(OpenNiWin.obj) : error LNK2019: unresolved external symbol __imp__niteStopSkeletonTracking referenced in function "public: void __thiscall nite::UserTracker::stopSkeletonTracking(short)" (?stopSkeletonTracking@UserTracker@nite@@QAEXF@Z)
1>JunkBox_Win_Lib.lib(OpenNiWin.obj) : error LNK2019: unresolved external symbol __imp__niteConvertJointCoordinatesToDepth referenced in function "public: enum nite::Status __thiscall nite::UserTracker::convertJointCoordinatesToDepth(float,float,float,float *,float *)const " (?convertJointCoordinatesToDepth@UserTracker@nite@@QBE?AW4Status@2@MMMPAM0@Z)
1>JunkBox_Lib++.lib(OpenNi2Tool.obj) : error LNK2019: unresolved external symbol __imp__niteStartSkeletonTracking referenced in function "public: enum nite::Status __thiscall nite::UserTracker::startSkeletonTracking(short)" (?startSkeletonTracking@UserTracker@nite@@QAE?AW4Status@2@F@Z)
1>JunkBox_Lib++.lib(OpenNi2Device.obj) : error LNK2019: unresolved external symbol __imp__niteUserTrackerFrameRelease referenced in function "public: void __thiscall nite::UserTrackerFrameRef::release(void)" (?release@UserTrackerFrameRef@nite@@QAEXXZ)
1>JunkBox_Lib++.lib(OpenNi2Device.obj) : error LNK2019: unresolved external symbol __imp__niteInitializeUserTrackerByDevice referenced in function "public: enum nite::Status __thiscall nite::UserTracker::create(class openni::Device *)" (?create@UserTracker@nite@@QAE?AW4Status@2@PAVDevice@openni@@@Z)
1>JunkBox_Lib++.lib(OpenNi2Device.obj) : error LNK2019: unresolved external symbol __imp__niteInitializeUserTracker referenced in function "public: enum nite::Status __thiscall nite::UserTracker::create(class openni::Device *)" (?create@UserTracker@nite@@QAE?AW4Status@2@PAVDevice@openni@@@Z)
1>JunkBox_Lib++.lib(OpenNi2Device.obj) : error LNK2019: unresolved external symbol __imp__niteShutdownUserTracker referenced in function "public: void __thiscall nite::UserTracker::destroy(void)" (?destroy@UserTracker@nite@@QAEXXZ)
1>JunkBox_Lib++.lib(OpenNi2Device.obj) : error LNK2019: unresolved external symbol __imp__niteSetSkeletonSmoothing referenced in function "public: enum nite::Status __thiscall nite::UserTracker::setSkeletonSmoothingFactor(float)" (?setSkeletonSmoothingFactor@UserTracker@nite@@QAE?AW4Status@2@M@Z)
1>JunkBox_Lib++.lib(OpenNi2Device.obj) : error LNK2019: unresolved external symbol __imp__niteReadUserTrackerFrame referenced in function "public: enum nite::Status __thiscall nite::UserTracker::readFrame(class nite::UserTrackerFrameRef *)" (?readFrame@UserTracker@nite@@QAE?AW4Status@2@PAVUserTrackerFrameRef@2@@Z)
1>JunkBox_Lib++.lib(OpenNi2Device.obj) : error LNK2019: unresolved external symbol __imp__niteInitialize referenced in function "public: static enum nite::Status __cdecl nite::NiTE::initialize(void)" (?initialize@NiTE@nite@@SA?AW4Status@2@XZ)
1>JunkBox_Lib++.lib(OpenNi2Device.obj) : error LNK2019: unresolved external symbol __imp__niteShutdown referenced in function "public: static void __cdecl nite::NiTE::shutdown(void)" (?shutdown@NiTE@nite@@SAXXZ)
1>C:\Users\Media Markt\Documents\Visual Studio 2010\Projects\Rinions\Rinions-3.4\Debug\Rinions.exe : fatal error LNK1120: 34 unresolved externals
1>
1>Build FAILED.
1>
1>Time Elapsed 00:02:55.97
========== Rebuild All: 0 succeeded, 1 failed, 0 skipped ==========
投票数:93 平均点:7.53

投稿ツリー

  条件検索へ


サイト内 検索

ログイン

ユーザー名:

パスワード:


パスワード紛失
新規登録

サブ メニュー

ミニカレンダー

前月2020年 7月翌月
1 2 3 4
5 6 7 8 9 10 11
12 13 14 15 16 17 18
19 20 21 22 23 24 25
26 27 28 29 30 31
<今日>

オンライン状況

28 人のユーザが現在オンラインです。 (1 人のユーザが Forum を参照しています。)

登録ユーザ: 0
ゲスト: 28

もっと...

アクセスカウンタ

今日 : 3232323232323232
昨日 : 5787578757875787
総計 : 1485967514859675148596751485967514859675148596751485967514859675
Powered by XOOPS Cube 2.1© 2001-2006 XOOPS Cube Project
Design by XoopsDesign.com