flagflag  If you want to see English page, please click "English" Button at Left.

Re: Please ask a question in easy English.

このトピックの投稿一覧へ

なし Re: Please ask a question in easy English.

msg# 1.17
depth:
1
前の投稿 - 次の投稿 | 親投稿 - 子投稿なし | 投稿日時 2013-7-12 19:41
fcassola  Not too shy to talk 居住地: Porto :: Portugal  投稿数: 24
Hello Iseki, sorry for the inconvinience, but im getting desperate ...
after doing all you've been told me, i get a lot of errors, as you can see.

Thanks, all the help will be welcome a lot!

1>------ Build started: Project: Rinions, Configuration: Debug Win32 ------
1>Build started 12/07/2013 11:34:06.
1>InitializeBuildStatus:
1> Touching "Debug\Rinions.unsuccessfulbuild".
1>ClCompile:
1> All outputs are up-to-date.
1> SensorFrame.cpp
1>c:\users\media markt\documents\visual studio 2010\projects\rinions_vs10\extend library\winnilib\kinectwin.h(39): error C2143: syntax error : missing ';' before '*'
1>c:\users\media markt\documents\visual studio 2010\projects\rinions_vs10\extend library\winnilib\kinectwin.h(39): error C4430: missing type specifier - int assumed. Note: C++ does not support default-int
1>c:\users\media markt\documents\visual studio 2010\projects\rinions_vs10\extend library\winnilib\kinectwin.h(39): error C4430: missing type specifier - int assumed. Note: C++ does not support default-int
1>c:\users\media markt\documents\visual studio 2010\projects\rinions_vs10\extend library\winnilib\kinectwin.h(158): error C2143: syntax error : missing ';' before '*'
1>c:\users\media markt\documents\visual studio 2010\projects\rinions_vs10\extend library\winnilib\kinectwin.h(158): error C2433: 'jbxwl::CKinectWin::CNiSpeech' : 'virtual' not permitted on data declarations
1>c:\users\media markt\documents\visual studio 2010\projects\rinions_vs10\extend library\winnilib\kinectwin.h(158): error C4430: missing type specifier - int assumed. Note: C++ does not support default-int
1>c:\users\media markt\documents\visual studio 2010\projects\rinions_vs10\extend library\winnilib\kinectwin.h(158): error C4430: missing type specifier - int assumed. Note: C++ does not support default-int
1>c:\users\media markt\documents\visual studio 2010\projects\rinions_vs10\extend library\winnilib\kinectwin.h(158): warning C4183: 'makeSpeech': missing return type; assumed to be a member function returning 'int'
1>c:\users\media markt\documents\visual studio 2010\projects\rinions_vs10\extend library\winnilib\kinectwin.h(156): error C2065: 'speech' : undeclared identifier
1>c:\users\media markt\documents\visual studio 2010\projects\rinions_vs10\extend library\winnilib\kinectwin.h(156): error C2065: 'speech' : undeclared identifier
1>c:\users\media markt\documents\visual studio 2010\projects\rinions_vs10\extend library\winnilib\kinectwin.h(156): error C2227: left of '->setConfidence' must point to class/struct/union/generic type
1> type is ''unknown-type''
1>c:\users\media markt\documents\visual studio 2010\projects\rinions_vs10\extend library\winnilib\kinectwin.h(158): error C2065: 'CNiSpeech' : undeclared identifier
1>c:\users\media markt\documents\visual studio 2010\projects\rinions_vs10\extend library\winnilib\kinectwin.h(158): error C2065: 'spch' : undeclared identifier
1>c:\users\media markt\documents\visual studio 2010\projects\rinions_vs10\extend library\winnilib\kinectwin.h(158): error C2061: syntax error : identifier 'CNiSpeech'
1>c:\users\media markt\documents\visual studio 2010\projects\rinions_vs10\extend library\winnilib\kinectwin.h(158): error C2065: 'spch' : undeclared identifier
1>c:\users\media markt\documents\visual studio 2010\projects\rinions_vs10\extend library\winnilib\nifiletool.h(44): warning C4010: single-line comment contains line-continuation character
1> Rinions.cpp
1>c:\users\media markt\documents\visual studio 2010\projects\rinions_vs10\extend library\winnilib\kinectwin.h(39): error C2143: syntax error : missing ';' before '*'
1>c:\users\media markt\documents\visual studio 2010\projects\rinions_vs10\extend library\winnilib\kinectwin.h(39): error C4430: missing type specifier - int assumed. Note: C++ does not support default-int
1>c:\users\media markt\documents\visual studio 2010\projects\rinions_vs10\extend library\winnilib\kinectwin.h(39): error C4430: missing type specifier - int assumed. Note: C++ does not support default-int
1>c:\users\media markt\documents\visual studio 2010\projects\rinions_vs10\extend library\winnilib\kinectwin.h(158): error C2143: syntax error : missing ';' before '*'
1>c:\users\media markt\documents\visual studio 2010\projects\rinions_vs10\extend library\winnilib\kinectwin.h(158): error C2433: 'jbxwl::CKinectWin::CNiSpeech' : 'virtual' not permitted on data declarations
1>c:\users\media markt\documents\visual studio 2010\projects\rinions_vs10\extend library\winnilib\kinectwin.h(158): error C4430: missing type specifier - int assumed. Note: C++ does not support default-int
1>c:\users\media markt\documents\visual studio 2010\projects\rinions_vs10\extend library\winnilib\kinectwin.h(158): error C4430: missing type specifier - int assumed. Note: C++ does not support default-int
1>c:\users\media markt\documents\visual studio 2010\projects\rinions_vs10\extend library\winnilib\kinectwin.h(158): warning C4183: 'makeSpeech': missing return type; assumed to be a member function returning 'int'
1>c:\users\media markt\documents\visual studio 2010\projects\rinions_vs10\extend library\winnilib\kinectwin.h(156): error C2065: 'speech' : undeclared identifier
1>c:\users\media markt\documents\visual studio 2010\projects\rinions_vs10\extend library\winnilib\kinectwin.h(156): error C2065: 'speech' : undeclared identifier
1>c:\users\media markt\documents\visual studio 2010\projects\rinions_vs10\extend library\winnilib\kinectwin.h(156): error C2227: left of '->setConfidence' must point to class/struct/union/generic type
1> type is ''unknown-type''
1>c:\users\media markt\documents\visual studio 2010\projects\rinions_vs10\extend library\winnilib\kinectwin.h(158): error C2065: 'CNiSpeech' : undeclared identifier
1>c:\users\media markt\documents\visual studio 2010\projects\rinions_vs10\extend library\winnilib\kinectwin.h(158): error C2065: 'spch' : undeclared identifier
1>c:\users\media markt\documents\visual studio 2010\projects\rinions_vs10\extend library\winnilib\kinectwin.h(158): error C2061: syntax error : identifier 'CNiSpeech'
1>c:\users\media markt\documents\visual studio 2010\projects\rinions_vs10\extend library\winnilib\kinectwin.h(158): error C2065: 'spch' : undeclared identifier
1>c:\users\media markt\documents\visual studio 2010\projects\rinions_vs10\extend library\winnilib\nifiletool.h(44): warning C4010: single-line comment contains line-continuation character
1> MainFrm.cpp
1>c:\users\media markt\documents\visual studio 2010\projects\rinions_vs10\extend library\winnilib\kinectwin.h(39): error C2143: syntax error : missing ';' before '*'
1>c:\users\media markt\documents\visual studio 2010\projects\rinions_vs10\extend library\winnilib\kinectwin.h(39): error C4430: missing type specifier - int assumed. Note: C++ does not support default-int
1>c:\users\media markt\documents\visual studio 2010\projects\rinions_vs10\extend library\winnilib\kinectwin.h(39): error C4430: missing type specifier - int assumed. Note: C++ does not support default-int
1>c:\users\media markt\documents\visual studio 2010\projects\rinions_vs10\extend library\winnilib\kinectwin.h(158): error C2143: syntax error : missing ';' before '*'
1>c:\users\media markt\documents\visual studio 2010\projects\rinions_vs10\extend library\winnilib\kinectwin.h(158): error C2433: 'jbxwl::CKinectWin::CNiSpeech' : 'virtual' not permitted on data declarations
1>c:\users\media markt\documents\visual studio 2010\projects\rinions_vs10\extend library\winnilib\kinectwin.h(158): error C4430: missing type specifier - int assumed. Note: C++ does not support default-int
1>c:\users\media markt\documents\visual studio 2010\projects\rinions_vs10\extend library\winnilib\kinectwin.h(158): error C4430: missing type specifier - int assumed. Note: C++ does not support default-int
1>c:\users\media markt\documents\visual studio 2010\projects\rinions_vs10\extend library\winnilib\kinectwin.h(158): warning C4183: 'makeSpeech': missing return type; assumed to be a member function returning 'int'
1>c:\users\media markt\documents\visual studio 2010\projects\rinions_vs10\extend library\winnilib\kinectwin.h(156): error C2065: 'speech' : undeclared identifier
1>c:\users\media markt\documents\visual studio 2010\projects\rinions_vs10\extend library\winnilib\kinectwin.h(156): error C2065: 'speech' : undeclared identifier
1>c:\users\media markt\documents\visual studio 2010\projects\rinions_vs10\extend library\winnilib\kinectwin.h(156): error C2227: left of '->setConfidence' must point to class/struct/union/generic type
1> type is ''unknown-type''
1>c:\users\media markt\documents\visual studio 2010\projects\rinions_vs10\extend library\winnilib\kinectwin.h(158): error C2065: 'CNiSpeech' : undeclared identifier
1>c:\users\media markt\documents\visual studio 2010\projects\rinions_vs10\extend library\winnilib\kinectwin.h(158): error C2065: 'spch' : undeclared identifier
1>c:\users\media markt\documents\visual studio 2010\projects\rinions_vs10\extend library\winnilib\kinectwin.h(158): error C2061: syntax error : identifier 'CNiSpeech'
1>c:\users\media markt\documents\visual studio 2010\projects\rinions_vs10\extend library\winnilib\kinectwin.h(158): error C2065: 'spch' : undeclared identifier
1>c:\users\media markt\documents\visual studio 2010\projects\rinions_vs10\extend library\winnilib\nifiletool.h(44): warning C4010: single-line comment contains line-continuation character
1> ExNiDevice.cpp
1>c:\users\media markt\documents\visual studio 2010\projects\rinions_vs10\extend library\winnilib\kinectwin.h(39): error C2143: syntax error : missing ';' before '*'
1>c:\users\media markt\documents\visual studio 2010\projects\rinions_vs10\extend library\winnilib\kinectwin.h(39): error C4430: missing type specifier - int assumed. Note: C++ does not support default-int
1>c:\users\media markt\documents\visual studio 2010\projects\rinions_vs10\extend library\winnilib\kinectwin.h(39): error C4430: missing type specifier - int assumed. Note: C++ does not support default-int
1>c:\users\media markt\documents\visual studio 2010\projects\rinions_vs10\extend library\winnilib\kinectwin.h(158): error C2143: syntax error : missing ';' before '*'
1>c:\users\media markt\documents\visual studio 2010\projects\rinions_vs10\extend library\winnilib\kinectwin.h(158): error C2433: 'jbxwl::CKinectWin::CNiSpeech' : 'virtual' not permitted on data declarations
1>c:\users\media markt\documents\visual studio 2010\projects\rinions_vs10\extend library\winnilib\kinectwin.h(158): error C4430: missing type specifier - int assumed. Note: C++ does not support default-int
1>c:\users\media markt\documents\visual studio 2010\projects\rinions_vs10\extend library\winnilib\kinectwin.h(158): error C4430: missing type specifier - int assumed. Note: C++ does not support default-int
1>c:\users\media markt\documents\visual studio 2010\projects\rinions_vs10\extend library\winnilib\kinectwin.h(158): warning C4183: 'makeSpeech': missing return type; assumed to be a member function returning 'int'
1>c:\users\media markt\documents\visual studio 2010\projects\rinions_vs10\extend library\winnilib\kinectwin.h(156): error C2065: 'speech' : undeclared identifier
1>c:\users\media markt\documents\visual studio 2010\projects\rinions_vs10\extend library\winnilib\kinectwin.h(156): error C2065: 'speech' : undeclared identifier
1>c:\users\media markt\documents\visual studio 2010\projects\rinions_vs10\extend library\winnilib\kinectwin.h(156): error C2227: left of '->setConfidence' must point to class/struct/union/generic type
1> type is ''unknown-type''
1>c:\users\media markt\documents\visual studio 2010\projects\rinions_vs10\extend library\winnilib\kinectwin.h(158): error C2065: 'CNiSpeech' : undeclared identifier
1>c:\users\media markt\documents\visual studio 2010\projects\rinions_vs10\extend library\winnilib\kinectwin.h(158): error C2065: 'spch' : undeclared identifier
1>c:\users\media markt\documents\visual studio 2010\projects\rinions_vs10\extend library\winnilib\kinectwin.h(158): error C2061: syntax error : identifier 'CNiSpeech'
1>c:\users\media markt\documents\visual studio 2010\projects\rinions_vs10\extend library\winnilib\kinectwin.h(158): error C2065: 'spch' : undeclared identifier
1>c:\users\media markt\documents\visual studio 2010\projects\rinions_vs10\extend library\winnilib\nifiletool.h(44): warning C4010: single-line comment contains line-continuation character
1>c:\users\media markt\documents\visual studio 2010\projects\rinions_vs10\exnilib\exnidevice.cpp(1845): error C2065: 'LNI_SPEECH_LANG_JP_KINECT' : undeclared identifier
1>c:\users\media markt\documents\visual studio 2010\projects\rinions_vs10\exnilib\exnidevice.cpp(1848): error C2065: 'LNI_SPEECH_LANG_US_KINECT' : undeclared identifier
1> ExKinectWin.cpp
1>c:\users\media markt\documents\visual studio 2010\projects\rinions_vs10\extend library\winnilib\kinectwin.h(39): error C2143: syntax error : missing ';' before '*'
1>c:\users\media markt\documents\visual studio 2010\projects\rinions_vs10\extend library\winnilib\kinectwin.h(39): error C4430: missing type specifier - int assumed. Note: C++ does not support default-int
1>c:\users\media markt\documents\visual studio 2010\projects\rinions_vs10\extend library\winnilib\kinectwin.h(39): error C4430: missing type specifier - int assumed. Note: C++ does not support default-int
1>c:\users\media markt\documents\visual studio 2010\projects\rinions_vs10\extend library\winnilib\kinectwin.h(158): error C2143: syntax error : missing ';' before '*'
1>c:\users\media markt\documents\visual studio 2010\projects\rinions_vs10\extend library\winnilib\kinectwin.h(158): error C2433: 'jbxwl::CKinectWin::CNiSpeech' : 'virtual' not permitted on data declarations
1>c:\users\media markt\documents\visual studio 2010\projects\rinions_vs10\extend library\winnilib\kinectwin.h(158): error C4430: missing type specifier - int assumed. Note: C++ does not support default-int
1>c:\users\media markt\documents\visual studio 2010\projects\rinions_vs10\extend library\winnilib\kinectwin.h(158): error C4430: missing type specifier - int assumed. Note: C++ does not support default-int
1>c:\users\media markt\documents\visual studio 2010\projects\rinions_vs10\extend library\winnilib\kinectwin.h(158): warning C4183: 'makeSpeech': missing return type; assumed to be a member function returning 'int'
1>c:\users\media markt\documents\visual studio 2010\projects\rinions_vs10\extend library\winnilib\kinectwin.h(156): error C2065: 'speech' : undeclared identifier
1>c:\users\media markt\documents\visual studio 2010\projects\rinions_vs10\extend library\winnilib\kinectwin.h(156): error C2065: 'speech' : undeclared identifier
1>c:\users\media markt\documents\visual studio 2010\projects\rinions_vs10\extend library\winnilib\kinectwin.h(156): error C2227: left of '->setConfidence' must point to class/struct/union/generic type
1> type is ''unknown-type''
1>c:\users\media markt\documents\visual studio 2010\projects\rinions_vs10\extend library\winnilib\kinectwin.h(158): error C2065: 'CNiSpeech' : undeclared identifier
1>c:\users\media markt\documents\visual studio 2010\projects\rinions_vs10\extend library\winnilib\kinectwin.h(158): error C2065: 'spch' : undeclared identifier
1>c:\users\media markt\documents\visual studio 2010\projects\rinions_vs10\extend library\winnilib\kinectwin.h(158): error C2061: syntax error : identifier 'CNiSpeech'
1>c:\users\media markt\documents\visual studio 2010\projects\rinions_vs10\extend library\winnilib\kinectwin.h(158): error C2065: 'spch' : undeclared identifier
1>c:\users\media markt\documents\visual studio 2010\projects\rinions_vs10\extend library\winnilib\nifiletool.h(44): warning C4010: single-line comment contains line-continuation character
1>c1xx : fatal error C1903: unable to recover from previous error(s); stopping compilation
1> SetDevice.cpp
1>c:\users\media markt\documents\visual studio 2010\projects\rinions_vs10\extend library\winnilib\kinectwin.h(39): error C2143: syntax error : missing ';' before '*'
1>c:\users\media markt\documents\visual studio 2010\projects\rinions_vs10\extend library\winnilib\kinectwin.h(39): error C4430: missing type specifier - int assumed. Note: C++ does not support default-int
1>c:\users\media markt\documents\visual studio 2010\projects\rinions_vs10\extend library\winnilib\kinectwin.h(39): error C4430: missing type specifier - int assumed. Note: C++ does not support default-int
1>c:\users\media markt\documents\visual studio 2010\projects\rinions_vs10\extend library\winnilib\kinectwin.h(158): error C2143: syntax error : missing ';' before '*'
1>c:\users\media markt\documents\visual studio 2010\projects\rinions_vs10\extend library\winnilib\kinectwin.h(158): error C2433: 'jbxwl::CKinectWin::CNiSpeech' : 'virtual' not permitted on data declarations
1>c:\users\media markt\documents\visual studio 2010\projects\rinions_vs10\extend library\winnilib\kinectwin.h(158): error C4430: missing type specifier - int assumed. Note: C++ does not support default-int
1>c:\users\media markt\documents\visual studio 2010\projects\rinions_vs10\extend library\winnilib\kinectwin.h(158): error C4430: missing type specifier - int assumed. Note: C++ does not support default-int
1>c:\users\media markt\documents\visual studio 2010\projects\rinions_vs10\extend library\winnilib\kinectwin.h(158): warning C4183: 'makeSpeech': missing return type; assumed to be a member function returning 'int'
1>c:\users\media markt\documents\visual studio 2010\projects\rinions_vs10\extend library\winnilib\kinectwin.h(156): error C2065: 'speech' : undeclared identifier
1>c:\users\media markt\documents\visual studio 2010\projects\rinions_vs10\extend library\winnilib\kinectwin.h(156): error C2065: 'speech' : undeclared identifier
1>c:\users\media markt\documents\visual studio 2010\projects\rinions_vs10\extend library\winnilib\kinectwin.h(156): error C2227: left of '->setConfidence' must point to class/struct/union/generic type
1> type is ''unknown-type''
1>c:\users\media markt\documents\visual studio 2010\projects\rinions_vs10\extend library\winnilib\kinectwin.h(158): error C2065: 'CNiSpeech' : undeclared identifier
1>c:\users\media markt\documents\visual studio 2010\projects\rinions_vs10\extend library\winnilib\kinectwin.h(158): error C2065: 'spch' : undeclared identifier
1>c:\users\media markt\documents\visual studio 2010\projects\rinions_vs10\extend library\winnilib\kinectwin.h(158): error C2061: syntax error : identifier 'CNiSpeech'
1>c:\users\media markt\documents\visual studio 2010\projects\rinions_vs10\extend library\winnilib\kinectwin.h(158): error C2065: 'spch' : undeclared identifier
1>c:\users\media markt\documents\visual studio 2010\projects\rinions_vs10\extend library\winnilib\nifiletool.h(44): warning C4010: single-line comment contains line-continuation character
1> SetDataSave.cpp
1>c:\users\media markt\documents\visual studio 2010\projects\rinions_vs10\extend library\winnilib\kinectwin.h(39): error C2143: syntax error : missing ';' before '*'
1>c:\users\media markt\documents\visual studio 2010\projects\rinions_vs10\extend library\winnilib\kinectwin.h(39): error C4430: missing type specifier - int assumed. Note: C++ does not support default-int
1>c:\users\media markt\documents\visual studio 2010\projects\rinions_vs10\extend library\winnilib\kinectwin.h(39): error C4430: missing type specifier - int assumed. Note: C++ does not support default-int
1>c:\users\media markt\documents\visual studio 2010\projects\rinions_vs10\extend library\winnilib\kinectwin.h(158): error C2143: syntax error : missing ';' before '*'
1>c:\users\media markt\documents\visual studio 2010\projects\rinions_vs10\extend library\winnilib\kinectwin.h(158): error C2433: 'jbxwl::CKinectWin::CNiSpeech' : 'virtual' not permitted on data declarations
1>c:\users\media markt\documents\visual studio 2010\projects\rinions_vs10\extend library\winnilib\kinectwin.h(158): error C4430: missing type specifier - int assumed. Note: C++ does not support default-int
1>c:\users\media markt\documents\visual studio 2010\projects\rinions_vs10\extend library\winnilib\kinectwin.h(158): error C4430: missing type specifier - int assumed. Note: C++ does not support default-int
1>c:\users\media markt\documents\visual studio 2010\projects\rinions_vs10\extend library\winnilib\kinectwin.h(158): warning C4183: 'makeSpeech': missing return type; assumed to be a member function returning 'int'
1>c:\users\media markt\documents\visual studio 2010\projects\rinions_vs10\extend library\winnilib\kinectwin.h(156): error C2065: 'speech' : undeclared identifier
1>c:\users\media markt\documents\visual studio 2010\projects\rinions_vs10\extend library\winnilib\kinectwin.h(156): error C2065: 'speech' : undeclared identifier
1>c:\users\media markt\documents\visual studio 2010\projects\rinions_vs10\extend library\winnilib\kinectwin.h(156): error C2227: left of '->setConfidence' must point to class/struct/union/generic type
1> type is ''unknown-type''
1>c:\users\media markt\documents\visual studio 2010\projects\rinions_vs10\extend library\winnilib\kinectwin.h(158): error C2065: 'CNiSpeech' : undeclared identifier
1>c:\users\media markt\documents\visual studio 2010\projects\rinions_vs10\extend library\winnilib\kinectwin.h(158): error C2065: 'spch' : undeclared identifier
1>c:\users\media markt\documents\visual studio 2010\projects\rinions_vs10\extend library\winnilib\kinectwin.h(158): error C2061: syntax error : identifier 'CNiSpeech'
1>c:\users\media markt\documents\visual studio 2010\projects\rinions_vs10\extend library\winnilib\kinectwin.h(158): error C2065: 'spch' : undeclared identifier
1>c:\users\media markt\documents\visual studio 2010\projects\rinions_vs10\extend library\winnilib\nifiletool.h(44): warning C4010: single-line comment contains line-continuation character
1> SetAnimation.cpp
1>c:\users\media markt\documents\visual studio 2010\projects\rinions_vs10\extend library\winnilib\kinectwin.h(39): error C2143: syntax error : missing ';' before '*'
1>c:\users\media markt\documents\visual studio 2010\projects\rinions_vs10\extend library\winnilib\kinectwin.h(39): error C4430: missing type specifier - int assumed. Note: C++ does not support default-int
1>c:\users\media markt\documents\visual studio 2010\projects\rinions_vs10\extend library\winnilib\kinectwin.h(39): error C4430: missing type specifier - int assumed. Note: C++ does not support default-int
1>c:\users\media markt\documents\visual studio 2010\projects\rinions_vs10\extend library\winnilib\kinectwin.h(158): error C2143: syntax error : missing ';' before '*'
1>c:\users\media markt\documents\visual studio 2010\projects\rinions_vs10\extend library\winnilib\kinectwin.h(158): error C2433: 'jbxwl::CKinectWin::CNiSpeech' : 'virtual' not permitted on data declarations
1>c:\users\media markt\documents\visual studio 2010\projects\rinions_vs10\extend library\winnilib\kinectwin.h(158): error C4430: missing type specifier - int assumed. Note: C++ does not support default-int
1>c:\users\media markt\documents\visual studio 2010\projects\rinions_vs10\extend library\winnilib\kinectwin.h(158): error C4430: missing type specifier - int assumed. Note: C++ does not support default-int
1>c:\users\media markt\documents\visual studio 2010\projects\rinions_vs10\extend library\winnilib\kinectwin.h(158): warning C4183: 'makeSpeech': missing return type; assumed to be a member function returning 'int'
1>c:\users\media markt\documents\visual studio 2010\projects\rinions_vs10\extend library\winnilib\kinectwin.h(156): error C2065: 'speech' : undeclared identifier
1>c:\users\media markt\documents\visual studio 2010\projects\rinions_vs10\extend library\winnilib\kinectwin.h(156): error C2065: 'speech' : undeclared identifier
1>c:\users\media markt\documents\visual studio 2010\projects\rinions_vs10\extend library\winnilib\kinectwin.h(156): error C2227: left of '->setConfidence' must point to class/struct/union/generic type
1> type is ''unknown-type''
1>c:\users\media markt\documents\visual studio 2010\projects\rinions_vs10\extend library\winnilib\kinectwin.h(158): error C2065: 'CNiSpeech' : undeclared identifier
1>c:\users\media markt\documents\visual studio 2010\projects\rinions_vs10\extend library\winnilib\kinectwin.h(158): error C2065: 'spch' : undeclared identifier
1>c:\users\media markt\documents\visual studio 2010\projects\rinions_vs10\extend library\winnilib\kinectwin.h(158): error C2061: syntax error : identifier 'CNiSpeech'
1>c:\users\media markt\documents\visual studio 2010\projects\rinions_vs10\extend library\winnilib\kinectwin.h(158): error C2065: 'spch' : undeclared identifier
1>c:\users\media markt\documents\visual studio 2010\projects\rinions_vs10\extend library\winnilib\nifiletool.h(44): warning C4010: single-line comment contains line-continuation character
1> FilePlayerDLG.cpp
1>c:\users\media markt\documents\visual studio 2010\projects\rinions_vs10\extend library\winnilib\kinectwin.h(39): error C2143: syntax error : missing ';' before '*'
1>c:\users\media markt\documents\visual studio 2010\projects\rinions_vs10\extend library\winnilib\kinectwin.h(39): error C4430: missing type specifier - int assumed. Note: C++ does not support default-int
1>c:\users\media markt\documents\visual studio 2010\projects\rinions_vs10\extend library\winnilib\kinectwin.h(39): error C4430: missing type specifier - int assumed. Note: C++ does not support default-int
1>c:\users\media markt\documents\visual studio 2010\projects\rinions_vs10\extend library\winnilib\kinectwin.h(158): error C2143: syntax error : missing ';' before '*'
1>c:\users\media markt\documents\visual studio 2010\projects\rinions_vs10\extend library\winnilib\kinectwin.h(158): error C2433: 'jbxwl::CKinectWin::CNiSpeech' : 'virtual' not permitted on data declarations
1>c:\users\media markt\documents\visual studio 2010\projects\rinions_vs10\extend library\winnilib\kinectwin.h(158): error C4430: missing type specifier - int assumed. Note: C++ does not support default-int
1>c:\users\media markt\documents\visual studio 2010\projects\rinions_vs10\extend library\winnilib\kinectwin.h(158): error C4430: missing type specifier - int assumed. Note: C++ does not support default-int
1>c:\users\media markt\documents\visual studio 2010\projects\rinions_vs10\extend library\winnilib\kinectwin.h(158): warning C4183: 'makeSpeech': missing return type; assumed to be a member function returning 'int'
1>c:\users\media markt\documents\visual studio 2010\projects\rinions_vs10\extend library\winnilib\kinectwin.h(156): error C2065: 'speech' : undeclared identifier
1>c:\users\media markt\documents\visual studio 2010\projects\rinions_vs10\extend library\winnilib\kinectwin.h(156): error C2065: 'speech' : undeclared identifier
1>c:\users\media markt\documents\visual studio 2010\projects\rinions_vs10\extend library\winnilib\kinectwin.h(156): error C2227: left of '->setConfidence' must point to class/struct/union/generic type
1> type is ''unknown-type''
1>c:\users\media markt\documents\visual studio 2010\projects\rinions_vs10\extend library\winnilib\kinectwin.h(158): error C2065: 'CNiSpeech' : undeclared identifier
1>c:\users\media markt\documents\visual studio 2010\projects\rinions_vs10\extend library\winnilib\kinectwin.h(158): error C2065: 'spch' : undeclared identifier
1>c:\users\media markt\documents\visual studio 2010\projects\rinions_vs10\extend library\winnilib\kinectwin.h(158): error C2061: syntax error : identifier 'CNiSpeech'
1>c:\users\media markt\documents\visual studio 2010\projects\rinions_vs10\extend library\winnilib\kinectwin.h(158): error C2065: 'spch' : undeclared identifier
1>c:\users\media markt\documents\visual studio 2010\projects\rinions_vs10\extend library\winnilib\nifiletool.h(44): warning C4010: single-line comment contains line-continuation character
1> DepthFrame.cpp
1>c:\users\media markt\documents\visual studio 2010\projects\rinions_vs10\extend library\winnilib\kinectwin.h(39): error C2143: syntax error : missing ';' before '*'
1>c:\users\media markt\documents\visual studio 2010\projects\rinions_vs10\extend library\winnilib\kinectwin.h(39): error C4430: missing type specifier - int assumed. Note: C++ does not support default-int
1>c:\users\media markt\documents\visual studio 2010\projects\rinions_vs10\extend library\winnilib\kinectwin.h(39): error C4430: missing type specifier - int assumed. Note: C++ does not support default-int
1>c:\users\media markt\documents\visual studio 2010\projects\rinions_vs10\extend library\winnilib\kinectwin.h(158): error C2143: syntax error : missing ';' before '*'
1>c:\users\media markt\documents\visual studio 2010\projects\rinions_vs10\extend library\winnilib\kinectwin.h(158): error C2433: 'jbxwl::CKinectWin::CNiSpeech' : 'virtual' not permitted on data declarations
1>c:\users\media markt\documents\visual studio 2010\projects\rinions_vs10\extend library\winnilib\kinectwin.h(158): error C4430: missing type specifier - int assumed. Note: C++ does not support default-int
1>c:\users\media markt\documents\visual studio 2010\projects\rinions_vs10\extend library\winnilib\kinectwin.h(158): error C4430: missing type specifier - int assumed. Note: C++ does not support default-int
1>c:\users\media markt\documents\visual studio 2010\projects\rinions_vs10\extend library\winnilib\kinectwin.h(158): warning C4183: 'makeSpeech': missing return type; assumed to be a member function returning 'int'
1>c:\users\media markt\documents\visual studio 2010\projects\rinions_vs10\extend library\winnilib\kinectwin.h(156): error C2065: 'speech' : undeclared identifier
1>c:\users\media markt\documents\visual studio 2010\projects\rinions_vs10\extend library\winnilib\kinectwin.h(156): error C2065: 'speech' : undeclared identifier
1>c:\users\media markt\documents\visual studio 2010\projects\rinions_vs10\extend library\winnilib\kinectwin.h(156): error C2227: left of '->setConfidence' must point to class/struct/union/generic type
1> type is ''unknown-type''
1>c:\users\media markt\documents\visual studio 2010\projects\rinions_vs10\extend library\winnilib\kinectwin.h(158): error C2065: 'CNiSpeech' : undeclared identifier
1>c:\users\media markt\documents\visual studio 2010\projects\rinions_vs10\extend library\winnilib\kinectwin.h(158): error C2065: 'spch' : undeclared identifier
1>c:\users\media markt\documents\visual studio 2010\projects\rinions_vs10\extend library\winnilib\kinectwin.h(158): error C2061: syntax error : identifier 'CNiSpeech'
1>c:\users\media markt\documents\visual studio 2010\projects\rinions_vs10\extend library\winnilib\kinectwin.h(158): error C2065: 'spch' : undeclared identifier
1>c:\users\media markt\documents\visual studio 2010\projects\rinions_vs10\extend library\winnilib\nifiletool.h(44): warning C4010: single-line comment contains line-continuation character
1> CameraView.cpp
1>c:\users\media markt\documents\visual studio 2010\projects\rinions_vs10\extend library\winnilib\kinectwin.h(39): error C2143: syntax error : missing ';' before '*'
1>c:\users\media markt\documents\visual studio 2010\projects\rinions_vs10\extend library\winnilib\kinectwin.h(39): error C4430: missing type specifier - int assumed. Note: C++ does not support default-int
1>c:\users\media markt\documents\visual studio 2010\projects\rinions_vs10\extend library\winnilib\kinectwin.h(39): error C4430: missing type specifier - int assumed. Note: C++ does not support default-int
1>c:\users\media markt\documents\visual studio 2010\projects\rinions_vs10\extend library\winnilib\kinectwin.h(158): error C2143: syntax error : missing ';' before '*'
1>c:\users\media markt\documents\visual studio 2010\projects\rinions_vs10\extend library\winnilib\kinectwin.h(158): error C2433: 'jbxwl::CKinectWin::CNiSpeech' : 'virtual' not permitted on data declarations
1>c:\users\media markt\documents\visual studio 2010\projects\rinions_vs10\extend library\winnilib\kinectwin.h(158): error C4430: missing type specifier - int assumed. Note: C++ does not support default-int
1>c:\users\media markt\documents\visual studio 2010\projects\rinions_vs10\extend library\winnilib\kinectwin.h(158): error C4430: missing type specifier - int assumed. Note: C++ does not support default-int
1>c:\users\media markt\documents\visual studio 2010\projects\rinions_vs10\extend library\winnilib\kinectwin.h(158): warning C4183: 'makeSpeech': missing return type; assumed to be a member function returning 'int'
1>c:\users\media markt\documents\visual studio 2010\projects\rinions_vs10\extend library\winnilib\kinectwin.h(156): error C2065: 'speech' : undeclared identifier
1>c:\users\media markt\documents\visual studio 2010\projects\rinions_vs10\extend library\winnilib\kinectwin.h(156): error C2065: 'speech' : undeclared identifier
1>c:\users\media markt\documents\visual studio 2010\projects\rinions_vs10\extend library\winnilib\kinectwin.h(156): error C2227: left of '->setConfidence' must point to class/struct/union/generic type
1> type is ''unknown-type''
1>c:\users\media markt\documents\visual studio 2010\projects\rinions_vs10\extend library\winnilib\kinectwin.h(158): error C2065: 'CNiSpeech' : undeclared identifier
1>c:\users\media markt\documents\visual studio 2010\projects\rinions_vs10\extend library\winnilib\kinectwin.h(158): error C2065: 'spch' : undeclared identifier
1>c:\users\media markt\documents\visual studio 2010\projects\rinions_vs10\extend library\winnilib\kinectwin.h(158): error C2061: syntax error : identifier 'CNiSpeech'
1>c:\users\media markt\documents\visual studio 2010\projects\rinions_vs10\extend library\winnilib\kinectwin.h(158): error C2065: 'spch' : undeclared identifier
1>c:\users\media markt\documents\visual studio 2010\projects\rinions_vs10\extend library\winnilib\nifiletool.h(44): warning C4010: single-line comment contains line-continuation character
1> Generating Code...
1> Compiling...
1> SetLogMode.cpp
1> Generating Code...
1> Compiling...
1> SetNetwork.cpp
1> Generating Code...
1> Compiling...
1> ExNiFileDev.cpp
1>c:\users\media markt\documents\visual studio 2010\projects\rinions_vs10\extend library\winnilib\nifiletool.h(44): warning C4010: single-line comment contains line-continuation character
1> Generating Code...
1> Compiling...
1> ExNiJoints.cpp
1> Generating Code...
1> Compiling...
1> ExNiSHMemory.cpp
1> Generating Code...
1> Skipping... (no relevant changes detected)
1> SetViewMode.cpp
1> SetSpeech.cpp
1> SetOutData.cpp
1> SetMotion.cpp
1> SHMJoints.cpp
1> SHMIF.cpp
1> ParameterSet.cpp
1> ExportNiData.cpp
1> ExNiNetwork.cpp
1>
1>Build FAILED.
1>
1>Time Elapsed 00:00:36.61
========== Build: 0 succeeded, 1 failed, 0 up-to-date, 0 skipped ==========
投票数:46 平均点:4.57

投稿ツリー

  条件検索へ


サイト内 検索

ログイン

ユーザー名:

パスワード:


パスワード紛失
新規登録

サブ メニュー

ミニカレンダー

前月2020年 3月翌月
1 2 3 4 5 6 7
8 9 10 11 12 13 14
15 16 17 18 19 20 21
22 23 24 25 26 27 28
29 30 31
<今日>

オンライン状況

98 人のユーザが現在オンラインです。 (1 人のユーザが Forum を参照しています。)

登録ユーザ: 0
ゲスト: 98

もっと...

アクセスカウンタ

今日 : 1912919129191291912919129
昨日 : 1610716107161071610716107
総計 : 1407982514079825140798251407982514079825140798251407982514079825
Powered by XOOPS Cube 2.1© 2001-2006 XOOPS Cube Project
Design by XoopsDesign.com