flagflag  

Offline Message and Mute List module fails to recompile in Ubuntu Lucid/OpenSim 0.7.0.2

List posts in the topic

なし Offline Message and Mute List module fails to recompile in Ubuntu Lucid/OpenSim 0.7.0.2

msg# 1
depth:
0
Previous post - Next post | Parent - Children.1 | Posted on 2011/1/28 11:06
roel  Just popping in   Posts: 7
context: OS 0.7.0.2, ubuntu lucid

log is attached


==========================
NSL_MODULES
==========================
Prebuild v2.0.4
Copyright (c) 2004-2008
Matthew Holmes (matthew@wildfiregames.com),
Dan Moorehead (dan05a@gmail.com),
David Hudson (jendave@yahoo.com),
Rob Loach (http://www.robloach.net),
C.J. Adams-Collier (cjac@colliertech.org),
See 'prebuild /usage' for help

Creating NAnt build files
...Creating project: NSLModules.Messaging.MuteList

NAnt 0.85 (Build 0.85.2478.0; release; 10/14/2006)
Copyright (C) 2001-2006 Gerry Shaw
http://nant.sourceforge.net

Buildfile: file:///home/dilis/OPT/298ALPHA/opensim-0.7.0.2-source/nsl.modules/OpenSim.NSLModules/OpenSim.build
Target framework: Mono 2.0 Profile
Target(s) specified: clean

[echo] Using 'mono-2.0' Framework

clean:

[echo] Deleting all builds from all configurations
[nant] /home/dilis/OPT/298ALPHA/opensim-0.7.0.2-source/nsl.modules/OpenSim.NSLModules/Messaging/MuteList/NSLModules.Messaging.MuteList.dll.build clean
Buildfile: file:///home/dilis/OPT/298ALPHA/opensim-0.7.0.2-source/nsl.modules/OpenSim.NSLModules/Messaging/MuteList/NSLModules.Messaging.MuteList.dll.build
Target framework: Mono 2.0 Profile
Target(s) specified: clean


clean:


BUILD SUCCEEDED

Total time: 0 seconds.


BUILD SUCCEEDED

Total time: 0.1 seconds.

NAnt 0.85 (Build 0.85.2478.0; release; 10/14/2006)
Copyright (C) 2001-2006 Gerry Shaw
http://nant.sourceforge.net

Buildfile: file:///home/dilis/OPT/298ALPHA/opensim-0.7.0.2-source/nsl.modules/OpenSim.NSLModules/OpenSim.build
Target framework: Mono 2.0 Profile
Target(s) specified: build

[echo] Using 'mono-2.0' Framework

init:


Release:

[echo] Platform unix

build:

[nant] /home/dilis/OPT/298ALPHA/opensim-0.7.0.2-source/nsl.modules/OpenSim.NSLModules/Messaging/MuteList/NSLModules.Messaging.MuteList.dll.build build
Buildfile: file:///home/dilis/OPT/298ALPHA/opensim-0.7.0.2-source/nsl.modules/OpenSim.NSLModules/Messaging/MuteList/NSLModules.Messaging.MuteList.dll.build
Target framework: Mono 2.0 Profile
Target(s) specified: build


build:

[echo] Build Directory is /home/dilis/OPT/298ALPHA/opensim-0.7.0.2-source/nsl.modules/OpenSim.NSLModules/Messaging/MuteList/bin/Release
[mkdir] Creating directory '/home/dilis/OPT/298ALPHA/opensim-0.7.0.2-source/nsl.modules/OpenSim.NSLModules/Messaging/MuteList/bin/Release'.
[csc] Compiling 1 files to '/home/dilis/OPT/298ALPHA/opensim-0.7.0.2-source/nsl.modules/OpenSim.NSLModules/Messaging/MuteList/bin/Release/NSLModules.Messaging.MuteList.dll'.
[csc] /home/dilis/OPT/298ALPHA/opensim-0.7.0.2-source/nsl.modules/OpenSim.NSLModules/Messaging/MuteList/NSLMuteListModule.cs(219,79): error CS0241: Default parameter specifiers are not permitted
[csc] /home/dilis/OPT/298ALPHA/opensim-0.7.0.2-source/nsl.modules/OpenSim.NSLModules/Messaging/MuteList/NSLMuteListModule.cs(219,92): error CS0241: Default parameter specifiers are not permitted
[csc] Compilation failed: 2 error(s), 0 warnings

BUILD FAILED - 0 non-fatal error(s), 2 warning(s)

/home/dilis/OPT/298ALPHA/opensim-0.7.0.2-source/nsl.modules/OpenSim.NSLModules/Messaging/MuteList/NSLModules.Messaging.MuteList.dll.build(14,6):
External Program Failed: /usr/lib/mono/2.0/gmcs.exe (return code was 1)

Total time: 0.3 seconds.


BUILD FAILED

Nested build failed. Refer to build log for exact reason.

Total time: 0.4 seconds.
Votes:264 Average:3.48

Posts tree

  Advanced search


Site Search

Login

Username:

Password:


Lost Password?
Register now!!

Sub Menu

mini Calendar

Last MonthMay 2024Next Month
Su Mo Tu We Th Fr Sa
1 2 3 4
5 6 7 8 9 10 11
12 13 14 15 16 17 18
19 20 21 22 23 24 25
26 27 28 29 30 31
Today

Who's Online

118 user(s) are online (5 user(s) are browsing Forum)

Members: 0
Guests: 118

more...

Access Counter

Today : 4052405240524052
Yesterday : 1716817168171681716817168
Total : 2350051323500513235005132350051323500513235005132350051323500513
Powered by XOOPS Cube 2.1© 2001-2006 XOOPS Cube Project
Design by XoopsDesign.com