flagflag  If you want to see English page, please click "English" Button at Left.

Please ask a question in easy English.

  • このフォーラムに新しいトピックを立てることはできません
  • このフォーラムではゲスト投稿が禁止されています
  • このトピックは管理者もしくはモデレータによりロックされています
前の投稿 - 次の投稿 | 親投稿 - 子投稿.1 .2 .3 .4 .5 .6 .7 .8 .9 .10 .11 .12 .13 .14 .15 .16 .17 .18 .19 .20 .21 | 投稿日時 2011-11-4 18:19 | 最終変更
iseki  Home away from home   投稿数: 1381
In the case of difficult English, we cannot answer.


Thanks kittin and galiciam for your message.

I would like to rest for a while.....
投票数:177 平均点:3.45
前の投稿 - 次の投稿 | 親投稿 - 子投稿.1 | 投稿日時 2012-1-18 4:36
Michel  Just popping in   投稿数: 3
Hello
When i press the Yellow play button the program crashes , idea why ?
投票数:108 平均点:4.63
前の投稿 - 次の投稿 | 親投稿 - 子投稿.1 | 投稿日時 2012-1-18 11:27 | 最終変更
iseki  Home away from home   投稿数: 1381
Hi Michel,

Please tell me more detail and your PC environment (version of Windows, OpenNI, NITE and avin driver etc.etc.)
Is Demo program of Kinect executed?
Is SLKinect crashed, when "Camera Image" is off?

If you use OpenNI 64bit driver, you need to use OpenNI 32bit driver or recompile SLKinect with 64bit library.

Thanks
投票数:100 平均点:4.80
前の投稿 - 次の投稿 | 親投稿 - 子投稿.1 | 投稿日時 2012-1-18 16:37 | 最終変更
iseki  Home away from home   投稿数: 1381
引用:

Please tell me more detail and your PC environment (version of Windows, OpenNI, NITE and avin driver etc.etc.)

If there is no NITE, SLKinect crashes when Yellow Play Button is clicked.
Is NITE installed?
投票数:94 平均点:3.94
前の投稿 - 次の投稿 | 親投稿 - 子投稿.1 | 投稿日時 2012-1-19 3:21
Michel  Just popping in   投稿数: 3
Hello this are the specs

Windows 7 X64
OpenNI 1.5.2.3 ( 32 bit)
NITE 1.5.2.21 (32 bit)
SensorKinect091-v5.1.0.25

Note that SLKinect 2.0 starts and image is shown in the sensor window

I have tryed it now on 3 different systems ( one was 32 bit Windows Vista ) all with the same result ( crash on press of yellow button )
so i guess i do something wrong in the installation but i do not understand what i do wrong
投票数:140 平均点:4.07
前の投稿 - 次の投稿 | 親投稿 - 子投稿.1 | 投稿日時 2012-1-19 10:03 | 最終変更
iseki  Home away from home   投稿数: 1381
I confirmed the error.

I compiled SLKinect2 with OpenNI(1.3.3.6) and NITE(1.4.2.4). SLKinect2 worked.
But when I use OpenNI(1.5.2.23) and NITE(1.5.2.21), It crashed.

I will check source code, please wait a little.
投票数:101 平均点:4.55
前の投稿 - 次の投稿 | 親投稿 - 子投稿.1 | 投稿日時 2012-1-19 12:00 | 最終変更
iseki  Home away from home   投稿数: 1381
Hi Michel,

Sorry this is a bug of code. I found a bug and fixed it.
With OpenNI-1.3.3.6 and NITE-1.4.2.4, OpenNI NeedPoseForCalibration() function returns TRUE.
But with OpenNI-1.5.2.23 and NITE-1.5.2.21, it returns FALSE.
I deleted this function from code.

Please download SLKinect-2.0.1.zip from
http://www.nsl.tuis.ac.jp/xoops/modules/d3downloads/index.php?page=singlefile&cid=7&lid=32
And re-install or exchange SLKiect2.exe

Thank you for your Bug Report!!
投票数:105 平均点:4.10
前の投稿 - 次の投稿 | 親投稿 - 子投稿.1 | 投稿日時 2012-1-19 17:58 | 最終変更
iseki  Home away from home   投稿数: 1381
引用:

With OpenNI-1.3.3.6 and NITE-1.4.2.4, OpenNI NeedPoseForCalibration() function returns TRUE.
But with OpenNI-1.5.2.23 and NITE-1.5.2.21, it returns FALSE.

Ohhhhhh.
I investigated about calibration pose.
It seems that it is really unnecessary in OpenNI-1.5.2.23 and NITE-1.5.2.21.
I need to rewrite a code at v2.1 sharply.

https://groups.google.com/forum/#!msg/openni-dev/E-c5qT0AA3k/3oQkExL6TQUJ
投票数:95 平均点:5.05
前の投稿 - 次の投稿 | 親投稿 - 子投稿なし | 投稿日時 2012-1-20 2:38
Michel  Just popping in   投稿数: 3
Hello iseki ,

Thank you verry much !! , it works now flawless on my systems i am verry pleased with your help !
投票数:70 平均点:4.57
前の投稿 - 次の投稿 | 親投稿 - 子投稿.1 | 投稿日時 2012-1-22 14:06
kinect_me  Just popping in   投稿数: 10
Hi i hope its ok to post a link.
The easiest way to install NIte etc is the all in one Zigfu installer

Its automatically installs

NITE: 1.5.2.21
OpenNI: 1.5.2.23
Sensor: 5.1.0.41
SensorKinect: 5.1.0.25

its an all in one easy to install package.

http://zigfu.com/devtools.html

Also you will have to install DXwebsetup from the net

I am confident this combination for the beginners will have you running SLkinect super quick.

Thanks again to the SLkinect team!!
投票数:168 平均点:3.45

なし Re: SLKinect2 crashes

msg# 1.1.1.1
前の投稿 - 次の投稿 | 親投稿 - 子投稿なし | 投稿日時 2012-1-22 15:03
iseki  Home away from home   投稿数: 1381
Hi kinect_me,

Tank you for your information!!
That page is very useful!!

I will add that link to our page.

Thanks.
投票数:99 平均点:2.32
前の投稿 - 次の投稿 | 親投稿 - 子投稿.1 | 投稿日時 2012-1-26 5:08
bobchang  Just popping in   投稿数: 5
Hi,

I am trying to use the program but is having a problem when using Animation on SLKinect 2.01. I followed all your instructions but is having a little difficult with running. Would you be able to help? I think we are having a problem with installing the program.

Thanks!
投票数:69 平均点:5.65
前の投稿 - 次の投稿 | 親投稿 - 子投稿.1 | 投稿日時 2012-1-26 8:56
iseki  Home away from home   投稿数: 1381
Hi bobchang,

What is your problem?
Please tell me about problem with more detail.

Thanks.
投票数:77 平均点:5.06
前の投稿 - 次の投稿 | 親投稿 - 子投稿.1 .2 | 投稿日時 2012-1-27 0:33
bobchang  Just popping in   投稿数: 5
Hi,

I followed the steps in using the problem, but when I run SLKinect 2 and put the UUID from Second Life into the program and run it, the program crashes.

Thanks!
投票数:80 平均点:5.38
前の投稿 - 次の投稿 | 親投稿 - 子投稿なし | 投稿日時 2012-1-27 2:12 | 最終変更
iseki  Home away from home   投稿数: 1381
Hi

What vesion is your Windows, OpenNI, NITE?

Does "run" mean that "click Yellow Play Button on Sensor Window" ?
投票数:77 平均点:3.77
前の投稿 - 次の投稿 | 親投稿 - 子投稿.1 | 投稿日時 2012-1-29 8:35
kinect_me  Just popping in   投稿数: 10
Hi Bob, i also had that problem
make sure you have installed dxwebsetup
If it still happens. then try running the standalone program directly from the download folder and run SLkinect2.exe
投票数:75 平均点:4.00
前の投稿 - 次の投稿 | 親投稿 - 子投稿なし | 投稿日時 2012-2-1 1:09
bobchang  Just popping in   投稿数: 5
I am running it on Windows 7. I downloaded OpenNI and NITE from http://zigfu.com/devtools.html, so I am hoping it is the right version! When I said run, it was meant for after the entering the UUID, not the click yellow button.

Thanks kincet_me, I will be trying that first!
投票数:63 平均点:3.97
前の投稿 - 次の投稿 | 親投稿 - 子投稿.1 | 投稿日時 2012-2-1 1:22
bobchang  Just popping in   投稿数: 5
Okay. After I put in the UUID from Second Life, SLKinect crashes, and says that the Description of File has stopped working. Help please!
投票数:76 平均点:3.55
前の投稿 - 次の投稿 | 親投稿 - 子投稿.1 | 投稿日時 2012-2-1 9:06 | 最終変更
iseki  Home away from home   投稿数: 1381
Hi,

Perhaps, you are a general user that can not write to "C:Program Files" folder.
In this case, all setting dialog will crash. (Sorry, this is Bug. I noticed now.)

Please copy SLKinect2.exe to any other writable Folder, and execute in that folder.
投票数:61 平均点:4.10
前の投稿 - 次の投稿 | 親投稿 - 子投稿なし | 投稿日時 2012-2-1 16:18 | 最終変更
iseki  Home away from home   投稿数: 1381
Hi

I fixed this Bug now.
Please re-download, and re-try it.

http://www.nsl.tuis.ac.jp/xoops/modules/d3downloads/index.php?page=singlefile&cid=7&lid=32

Thanks for your bug report!!
投票数:51 平均点:4.90
前の投稿 - 次の投稿 | 親投稿 - 子投稿.1 | 投稿日時 2012-2-10 1:27
bobchang  Just popping in   投稿数: 5
Hi,

I got SL Kinect 2 to work but is having a hard time getting ANM to install. Help again! Thanks for all your help.
投票数:109 平均点:3.76
前の投稿 - 次の投稿 | 親投稿 - 子投稿なし | 投稿日時 2012-2-10 12:10
iseki  Home away from home   投稿数: 1381
If you use v2.0.2, I have no idea, sorry.


Someone, is there any person of the same situation?
Please teach me the more information.
投票数:117 平均点:2.48
前の投稿 - 次の投稿 | 親投稿 - 子投稿.1 | 投稿日時 2012-4-7 3:57
kinect_me  Just popping in   投稿数: 10
Hi,
I love SLkinect,i wish there to be further development of this wonderful project.
If i can recommend some useful advice

http://arena.openni.org/

Here you can join the makers of OpenNI website to submit SLkinect source code to a bigger kinect online community.

Secondlife /open sim is the perfect environment for Kinect when preparing a stylish 3D avatar, SLkinect is perfect for instant 3D world,
Really i wish to see SLkinect improved to be faster & bring full range of motions with accurate skeleton tracking
OpenNI .org has a wide range of Windows open source programs specifically for kinect programmers.
I suggest SLkinect Source Code can be shared there and hopefully can be improved upon,
投票数:71 平均点:4.08
前の投稿 - 次の投稿 | 親投稿 - 子投稿なし | 投稿日時 2012-4-7 20:09 | 最終変更
iseki  Home away from home   投稿数: 1381
Hi kinect_me

Thank you for your advice.
I looked at the http://arena.openni.org/.
That is cool site!!

Now, Rinions (new version of SLKinect) works with OpenNI or MS Kinect SDK (those are selected automatically).
I worry about whether Rinions is suitable to http://arena.openni.org/.

Rinios has elementary bugs, yet.
Now I am making function that saving BVH file. If this function is implemented, all functions of our first plan are implemented.
Then I want to upload next version Rinions to that site.

Very Thanks.
投票数:89 平均点:3.48
前の投稿 - 次の投稿 | 親投稿 - 子投稿.1 | 投稿日時 2012-4-21 7:40
kinect_me  Just popping in   投稿数: 10
Hi Iseki great job of the new rinions, i like how you have made rionions viewer to start firestorm & imprudence :)
I am happy legs are working better and it is a lot faster!
I have some kinect tips to share

http://kinecttoolbox.codeplex.com/
this program is for microsft SDK the open source version is below
http://kinecttoolbox.codeplex.com/SourceControl/list/changesets#
click the disk icon to download.

it has some features

Postures

Algorithmic Posture Detector can detect the following postures:
None
Hands Joined
Left Hand Over Head
Right Hand Over Head
Left Hello
Right Hello

Templated Posture Detector can record postures in a learning machine and detect them later. Using this class, you can detect every kind of 2D postures (letters...)

Skeleton Stability

BarycenterHelper can indicate if a skeleton is static or is moving.

the code is open source hopefully this will help improve Rionions.
投票数:66 平均点:5.00
前の投稿 - 次の投稿 | 親投稿 - 子投稿なし | 投稿日時 2012-4-22 18:15
iseki  Home away from home   投稿数: 1381
Hi kinect_me,

Tank you for your information!!

I'll check that site.

Thanks much!!
投票数:48 平均点:4.38
前の投稿 - 次の投稿 | 親投稿 - 子投稿.1 | 投稿日時 2012-4-24 17:28
kinect_me  Just popping in   投稿数: 10
I am enjoying the microsoft SDK drivers with Rinions, seems to be working the best. The openni drivers also work good, but i am finding the skeleton is shaking more. A good feature of the openni driver is that it tracks better from the side, enabling your secondlife character to turn nearly 360 degrees.

can you tell me if Rinions can work with 2 x Kinects connected together. For example one kinect in front and one tracking behind me, or placed at another location; that would be interesting.

I have the 1 x xbox kinect, sadly i heard the PC version of kinect is slightly more advanced and microsoft have released a firmware for it,

Anyways good work, Rinions is my favourite, now much better than dance miku miku,:)

thank you, please accept donation of $20 i have given to help support your project.
投票数:57 平均点:4.91
前の投稿 - 次の投稿 | 親投稿 - 子投稿なし | 投稿日時 2012-4-24 18:15 | 最終変更
iseki  Home away from home   投稿数: 1381
Thank you very much for your donation!!
I am very happy about your cooperation.

>> but i am finding the skeleton is shaking more.

How about using the Moving Average?
"Setting" menu -> "Motion" -> "Moving Average Smoothing",
Exponential, Order is about 5-6
Sorry, I did not write this explain at Wiki.
To write document is more difficult than to create program.

I am developing functions as below now
1. Save to BVH file
2. Read from VMD (MMD Motion) file.
3. Eyes, Mouth and Finger motion of Avatar.

I do not research about multi kinects now, but it is very interesting.
I would like to try it when I have enough time.

Thanks much!!
投票数:113 平均点:6.46
前の投稿 - 次の投稿 | 親投稿 - 子投稿なし | 投稿日時 2012-5-11 8:06
kinect_me  Just popping in   投稿数: 10
Sounds great. Rinions is the best!!
投票数:65 平均点:4.31
前の投稿 - 次の投稿 | 親投稿 - 子投稿.1 | 投稿日時 2013-5-9 23:14
fcassola  Not too shy to talk 居住地: Porto :: Portugal  投稿数: 24
Hello,
im very pleased with the rinions project, the videos and information that i see on the internet was fabulous.
Congratulations to the researchers of the Network System Laboratory of TUIS ...
Im a PhD researcher and actually im starting a research project about the use of virtual worlds with motion capture, so, as you imagine this project his amazing!
Im trying to install the rinion on windows 8 64bit but i've no success ... its only working with windows7 ?
Further more i've much questions, but for the beggining ...

Many thanks guys!
投票数:39 平均点:4.62
前の投稿 - 次の投稿 | 親投稿 - 子投稿なし | 投稿日時 2013-5-9 23:36 | 最終変更
iseki  Home away from home   投稿数: 1381
Hi fcassola,

Thank you for your interest

We have only Winows7 PCs.
Because our research budget is not enough, scheduled for introduction of development environment of Windows8 PC is undecided now .

Because Rinions is open source, if you have development environment of Windows8, you can try to compile Rnions.

Thanks.
投票数:43 平均点:4.65
前の投稿 - 次の投稿 | 親投稿 - 子投稿なし | 投稿日時 2013-5-14 20:02
fcassola  Not too shy to talk 居住地: Porto :: Portugal  投稿数: 24
Hello iseki,
I managed to put the 32-bit version of rinions running on windows 8 64 bit, the 64-bit version does not work on my computer.
What i've done was nothing special and only have to place the permissions to admin and the compatibility mode to windows 7.

Now i've just starting to explore your code to see what can i do ...

Many thanks for your atention

I keep you noticed.

Fernando Cassola
Portugal
投票数:40 平均点:4.00
前の投稿 - 次の投稿 | 親投稿 - 子投稿.1 | 投稿日時 2013-7-2 0:12
fcassola  Not too shy to talk 居住地: Porto :: Portugal  投稿数: 24
Hello iseki,

as i told you last weeks im exploring the Rinions code in windows 8.
I'm trying to compile the project but at this moment i'm having a some problems on the instructions for mixing the Windows 8.0 SDK and DirectX SDK ... particularly on the d3dx9... of the windows directx SDK.

Can you help me with this problem, giving me some tips, or do you think thats because windows8 sistem operatitve?

Many thanks for your atention

I keep you noticed.

Fernando Cassola
Portugal
投票数:39 平均点:5.38
前の投稿 - 次の投稿 | 親投稿 - 子投稿なし | 投稿日時 2013-7-2 14:04
iseki  Home away from home   投稿数: 1381
Hi,

What kind of problem is it specifically?

I am going to purchase Windows 8 this month.
Since it is a budget of a university, it takes time for a while.

When development environment is ready, I compile Rinions.
投票数:43 平均点:3.95
前の投稿 - 次の投稿 | 親投稿 - 子投稿.1 | 投稿日時 2013-7-2 18:38
fcassola  Not too shy to talk 居住地: Porto :: Portugal  投稿数: 24
Hi Iseki !

The problem is because the windows 8 brings his own SDK game development, so when i install DirectX 9 SDK on the d3dx9tex.h, d3dx9mesh.h and other d3d9 classes it gave me overload problems and even undefined identifiers ...

Has you can see on the microsoft page, it says that "D3DX is only available for download in previous versions of the DirectX SDK. The D3DCSX DirectCompute utility library is available in the Windows SDK."
( http://msdn.microsoft.com/en-us/library/windows/desktop/ee663275(v=vs.85).aspx )

In some game develpment foruns some guys have the same problem ...

Actually, because i need to understand how is the communication between the rinions and the movements server (ANM_SERVER) i'm trying to unnistall the DirectX9 SDK and recompile with the new windows8 SDK ...

Many thanks for your atention

I keep you noticed.

Fernando Cassola
Portugal
投票数:46 平均点:3.91
前の投稿 - 次の投稿 | 親投稿 - 子投稿.1 | 投稿日時 2013-7-3 11:47
iseki  Home away from home   投稿数: 1381
Hi fcassola,

I am completely ignorant about this problem.
It seems that this problem is not understood by me unless I compile Rinions on Windows8 actually.

Since I will confirm this problem, please wait a little.

Thanks.
投票数:40 平均点:4.25
前の投稿 - 次の投稿 | 親投稿 - 子投稿.1 | 投稿日時 2013-7-9 17:02
iseki  Home away from home   投稿数: 1381
Hi,

I installed Windows 8 64bit, Kinect SDK 1.7, OpenNI/NITE 2.2, DirectX SDK (Jun10) and VS2012

1. Rinions64-3.4 (http://www.nsl.tuis.ac.jp/xoops/modules/xpwiki/?Rinions%2FDownload%2FLatest) can work with Kisnet SDK and OpenNI in Windows 8.

2. I compiled Rinions x64 with VS2012. I can build Rinions x64 and Rinions works with Kinect SDK. But Rinions does not recognize OpenNI.

Next, I uninstalled VS2012 and installed VS2010.

3. I compiled Rinions x64 with VS2010. I can build Rinions x64 and Rinions works with Kinect SDK. But Rinions does not recognize OpenNI. (same result with VS2012)

Thanks.
投票数:44 平均点:4.09
前の投稿 - 次の投稿 | 親投稿 - 子投稿なし | 投稿日時 2013-7-9 18:40
iseki  Home away from home   投稿数: 1381
引用:

2. I compiled Rinions x64 with VS2012. I can build Rinions x64 and Rinions works with Kinect SDK. But Rinions does not recognize OpenNI.
3. I compiled Rinions x64 with VS2010. I can build Rinions x64 and Rinions works with Kinect SDK. But Rinions does not recognize OpenNI. (same result with VS2012)

When copying a suitable runtime library and driver, Rinions recognized OpenNI.
投票数:40 平均点:5.00
前の投稿 - 次の投稿 | 親投稿 - 子投稿.1 | 投稿日時 2013-7-10 22:57
fcassola  Not too shy to talk 居住地: Porto :: Portugal  投稿数: 24
I Iseki,
did you made any changes on the code to compile the code?

Actually im still unnistalling vs2012 and installing vs2010, lets see what's going to happen!

Many thanks,

it's great to have another person working at the same time ...
投票数:36 平均点:4.17
前の投稿 - 次の投稿 | 親投稿 - 子投稿なし | 投稿日時 2013-7-11 0:40
iseki  Home away from home   投稿数: 1381
Hi

I did not change source code.
I change only Kinect SDK path 1.6 -> 1.7 in project property (I used Kinect SDK 1.7 in this time).

I could compile Rinions using VS2012, although very much warning is outputted.

Thanks
投票数:38 平均点:4.74
前の投稿 - 次の投稿 | 親投稿 - 子投稿.1 | 投稿日時 2013-7-11 8:43
fcassola  Not too shy to talk 居住地: Porto :: Portugal  投稿数: 24
Strange, in vs2012 it gave me a lot errors.
So i give up and actually im trying to compile the rinions with vs2010...

thanks a lot
投票数:39 平均点:5.38
前の投稿 - 次の投稿 | 親投稿 - 子投稿なし | 投稿日時 2013-7-11 9:10 | 最終変更
iseki  Home away from home   投稿数: 1381
Latest source code of v3.4 is by subversion.
Do you use this source?

http://www.nsl.tuis.ac.jp/xoops/modules/xpwiki/?Rinions%2FDownload%2FLatest#cc876aa7


One more.

What grade of VS do you use?
As JunkBox_Win_Lib use MFC, it cannot compile by VS Express. Please use Professional or premium.
I used VS Professional.
投票数:51 平均点:5.10
前の投稿 - 次の投稿 | 親投稿 - 子投稿.1 | 投稿日時 2013-7-11 18:51
fcassola  Not too shy to talk 居住地: Porto :: Portugal  投稿数: 24
Iseki, thanks for your help.
I use the most recent source code, and my vs2010 is the professional one ...
Ive found errors on compiling, particularly on the link modules, here is the compilation window ...
SORRY for the inconvinience!

1>------ Rebuild All started: Project: Rinions, Configuration: Debug Win32 ------
1>Build started 11/07/2013 10:12:01.
1>_PrepareForClean:
1> Deleting file "Debug\Rinions.lastbuildstate".
1>InitializeBuildStatus:
1> Touching "Debug\Rinions.unsuccessfulbuild".
1>ClCompile:
1> stdafx.cpp
1> SHMJoints.cpp
1> SHMIF.cpp
1> CameraView.cpp
1>c:\users\media markt\documents\visual studio 2010\projects\rinions\junkbox_lib++\graphlib\gio.h(449): warning C4129: '' : unrecognized character escape sequence
1> SensorFrame.cpp
1>c:\users\media markt\documents\visual studio 2010\projects\rinions\junkbox_lib++\graphlib\gio.h(449): warning C4129: '' : unrecognized character escape sequence
1> Rinions.cpp
1>c:\users\media markt\documents\visual studio 2010\projects\rinions\junkbox_lib++\graphlib\gio.h(449): warning C4129: '' : unrecognized character escape sequence
1> ParameterSet.cpp
1> MainFrm.cpp
1>c:\users\media markt\documents\visual studio 2010\projects\rinions\junkbox_lib++\graphlib\gio.h(449): warning C4129: '' : unrecognized character escape sequence
1> ExportNiData.cpp
1> ExOpenNiWin.cpp
1>c:\users\media markt\documents\visual studio 2010\projects\rinions\junkbox_lib++\graphlib\gio.h(449): warning C4129: '' : unrecognized character escape sequence
1> ExNiSHMemory.cpp
1>c:\users\media markt\documents\visual studio 2010\projects\rinions\junkbox_lib++\graphlib\gio.h(449): warning C4129: '' : unrecognized character escape sequence
1> ExNiNetwork.cpp
1> ExNiJoints.cpp
1> ExNiFileDev.cpp
1> ExNiDevice.cpp
1>c:\users\media markt\documents\visual studio 2010\projects\rinions\junkbox_lib++\graphlib\gio.h(449): warning C4129: '' : unrecognized character escape sequence
1> ExKinectWin.cpp
1>c:\users\media markt\documents\visual studio 2010\projects\rinions\junkbox_lib++\graphlib\gio.h(449): warning C4129: '' : unrecognized character escape sequence
1> SetViewMode.cpp
1> SetSpeech.cpp
1> SetOutData.cpp
1> SetNetwork.cpp
1> SetMotion.cpp
1> Generating Code...
1> Compiling...
1> SetLogMode.cpp
1> SetDevice.cpp
1>c:\users\media markt\documents\visual studio 2010\projects\rinions\junkbox_lib++\graphlib\gio.h(449): warning C4129: '' : unrecognized character escape sequence
1> SetDataSave.cpp
1>c:\users\media markt\documents\visual studio 2010\projects\rinions\junkbox_lib++\graphlib\gio.h(449): warning C4129: '' : unrecognized character escape sequence
1> SetAnimation.cpp
1>c:\users\media markt\documents\visual studio 2010\projects\rinions\junkbox_lib++\graphlib\gio.h(449): warning C4129: '' : unrecognized character escape sequence
1> FilePlayerDLG.cpp
1>c:\users\media markt\documents\visual studio 2010\projects\rinions\junkbox_lib++\graphlib\gio.h(449): warning C4129: '' : unrecognized character escape sequence
1> DepthFrame.cpp
1>c:\users\media markt\documents\visual studio 2010\projects\rinions\junkbox_lib++\graphlib\gio.h(449): warning C4129: '' : unrecognized character escape sequence
1> Generating Code...
1>NiTE2.lib : warning LNK4003: invalid library format; library ignored
1>opencv_core242d.lib : warning LNK4003: invalid library format; library ignored
1>opencv_imgproc242d.lib : warning LNK4003: invalid library format; library ignored
1>opencv_objdetect242d.lib : warning LNK4003: invalid library format; library ignored
1>zlibd.lib : warning LNK4003: invalid library format; library ignored
1>NiTE2.lib : warning LNK4003: invalid library format; library ignored
1>opencv_core242d.lib : warning LNK4003: invalid library format; library ignored
1>opencv_imgproc242d.lib : warning LNK4003: invalid library format; library ignored
1>opencv_objdetect242d.lib : warning LNK4003: invalid library format; library ignored
1>zlibd.lib : warning LNK4003: invalid library format; library ignored
1>LINK : warning LNK4199: /DELAYLOAD:OpenNI.dll ignored; no imports found from OpenNI.dll
1>LINK : warning LNK4199: /DELAYLOAD:NiTE2.dll ignored; no imports found from NiTE2.dll
1>ExNiJoints.obj : error LNK2019: unresolved external symbol "public: virtual __thiscall cv::CascadeClassifier::~CascadeClassifier(void)" (??1CascadeClassifier@cv@@UAE@XZ) referenced in function __unwindfunclet$??0CExNiJoints@jbxwl@@QAE@XZ$0
1>ExNiJoints.obj : error LNK2019: unresolved external symbol "public: __thiscall cv::CascadeClassifier::CascadeClassifier(void)" (??0CascadeClassifier@cv@@QAE@XZ) referenced in function "public: __thiscall jbxwl::CExNiJoints::CExNiJoints(void)" (??0CExNiJoints@jbxwl@@QAE@XZ)
1>ExNiJoints.obj : error LNK2019: unresolved external symbol "public: bool __thiscall cv::CascadeClassifier::load(class std::basic_string<char,struct std::char_traits<char>,class std::allocator<char> > const &)" (?load@CascadeClassifier@cv@@QAE_NABV?$basic_string@DU?$char_traits@D@std@@V?$allocator@D@2@@std@@@Z) referenced in function "public: int __thiscall jbxwl::CExNiJoints::init_opencv(void)" (?init_opencv@CExNiJoints@jbxwl@@QAEHXZ)
1>ExNiJoints.obj : error LNK2001: unresolved external symbol "public: virtual bool __thiscall cv::CascadeClassifier::empty(void)const " (?empty@CascadeClassifier@cv@@UBE_NXZ)
1>ExNiJoints.obj : error LNK2001: unresolved external symbol "public: virtual bool __thiscall cv::CascadeClassifier::read(class cv::FileNode const &)" (?read@CascadeClassifier@cv@@UAE_NABVFileNode@2@@Z)
1>ExNiJoints.obj : error LNK2001: unresolved external symbol "public: virtual void __thiscall cv::CascadeClassifier::detectMultiScale(class cv::Mat const &,class std::vector<class cv::Rect_<int>,class std::allocator<class cv::Rect_<int> > > &,class std::vector<int,class std::allocator<int> > &,class std::vector<double,class std::allocator<double> > &,double,int,int,class cv::Size_<int>,class cv::Size_<int>,bool)" (?detectMultiScale@CascadeClassifier@cv@@UAEXABVMat@2@AAV?$vector@V?$Rect_@H@cv@@V?$allocator@V?$Rect_@H@cv@@@std@@@std@@AAV?$vector@HV?$allocator@H@std@@@5@AAV?$vector@NV?$allocator@N@std@@@5@NHHV?$Size_@H@2@4_N@Z)
1>ExNiJoints.obj : error LNK2001: unresolved external symbol "public: virtual void __thiscall cv::CascadeClassifier::detectMultiScale(class cv::Mat const &,class std::vector<class cv::Rect_<int>,class std::allocator<class cv::Rect_<int> > > &,double,int,int,class cv::Size_<int>,class cv::Size_<int>)" (?detectMultiScale@CascadeClassifier@cv@@UAEXABVMat@2@AAV?$vector@V?$Rect_@H@cv@@V?$allocator@V?$Rect_@H@cv@@@std@@@std@@NHHV?$Size_@H@2@2@Z)
1>ExNiJoints.obj : error LNK2001: unresolved external symbol "public: virtual class cv::Size_<int> __thiscall cv::CascadeClassifier::getOriginalWindowSize(void)const " (?getOriginalWindowSize@CascadeClassifier@cv@@UBE?AV?$Size_@H@2@XZ)
1>ExNiJoints.obj : error LNK2001: unresolved external symbol "protected: virtual bool __thiscall cv::CascadeClassifier::detectSingleScale(class cv::Mat const &,int,class cv::Size_<int>,int,int,double,class std::vector<class cv::Rect_<int>,class std::allocator<class cv::Rect_<int> > > &,class std::vector<int,class std::allocator<int> > &,class std::vector<double,class std::allocator<double> > &,bool)" (?detectSingleScale@CascadeClassifier@cv@@MAE_NABVMat@2@HV?$Size_@H@2@HHNAAV?$vector@V?$Rect_@H@cv@@V?$allocator@V?$Rect_@H@cv@@@std@@@std@@AAV?$vector@HV?$allocator@H@std@@@6@AAV?$vector@NV?$allocator@N@std@@@6@_N@Z)
1>ExNiJoints.obj : error LNK2001: unresolved external symbol "protected: virtual int __thiscall cv::CascadeClassifier::runAt(class cv::Ptr<class cv::FeatureEvaluator> &,class cv::Point_<int>,double &)" (?runAt@CascadeClassifier@cv@@MAEHAAV?$Ptr@VFeatureEvaluator@cv@@@2@V?$Point_@H@2@AAN@Z)
1>ExNiJoints.obj : error LNK2019: unresolved external symbol "void __cdecl cv::resize(class cv::_InputArray const &,class cv::_OutputArray const &,class cv::Size_<int>,double,double,int)" (?resize@cv@@YAXABV_InputArray@1@ABV_OutputArray@1@V?$Size_@H@1@NNH@Z) referenced in function "struct _rectangle * __cdecl jbxl::cvDetectObjects<unsigned char>(class cv::CascadeClassifier,class jbxl::MSGraph<unsigned char> *,int &,int,double)" (??$cvDetectObjects@E@jbxl@@YAPAU_rectangle@@VCascadeClassifier@cv@@PAV?$MSGraph@E@0@AAHHN@Z)
1>ExNiJoints.obj : error LNK2019: unresolved external symbol "void __cdecl cv::equalizeHist(class cv::_InputArray const &,class cv::_OutputArray const &)" (?equalizeHist@cv@@YAXABV_InputArray@1@ABV_OutputArray@1@@Z) referenced in function "struct _rectangle * __cdecl jbxl::cvDetectObjects<unsigned char>(class cv::CascadeClassifier,class jbxl::MSGraph<unsigned char> *,int &,int,double)" (??$cvDetectObjects@E@jbxl@@YAPAU_rectangle@@VCascadeClassifier@cv@@PAV?$MSGraph@E@0@AAHHN@Z)
1>ExNiJoints.obj : error LNK2019: unresolved external symbol "public: __thiscall cv::_InputArray::_InputArray(class cv::Mat const &)" (??0_InputArray@cv@@QAE@ABVMat@1@@Z) referenced in function "struct _rectangle * __cdecl jbxl::cvDetectObjects<unsigned char>(class cv::CascadeClassifier,class jbxl::MSGraph<unsigned char> *,int &,int,double)" (??$cvDetectObjects@E@jbxl@@YAPAU_rectangle@@VCascadeClassifier@cv@@PAV?$MSGraph@E@0@AAHHN@Z)
1>ExNiJoints.obj : error LNK2019: unresolved external symbol "public: __thiscall cv::_OutputArray::_OutputArray(class cv::Mat &)" (??0_OutputArray@cv@@QAE@AAVMat@1@@Z) referenced in function "struct _rectangle * __cdecl jbxl::cvDetectObjects<unsigned char>(class cv::CascadeClassifier,class jbxl::MSGraph<unsigned char> *,int &,int,double)" (??$cvDetectObjects@E@jbxl@@YAPAU_rectangle@@VCascadeClassifier@cv@@PAV?$MSGraph@E@0@AAHHN@Z)
1>ExNiJoints.obj : error LNK2019: unresolved external symbol "public: void __thiscall cv::Mat::copySize(class cv::Mat const &)" (?copySize@Mat@cv@@QAEXABV12@@Z) referenced in function "public: __thiscall cv::Mat::Mat(class cv::Mat const &)" (??0Mat@cv@@QAE@ABV01@@Z)
1>ExNiJoints.obj : error LNK2019: unresolved external symbol "int __cdecl cv::_interlockedExchangeAdd(int *,int)" (?_interlockedExchangeAdd@cv@@YAHPAHH@Z) referenced in function "public: __thiscall cv::Mat::Mat(class cv::Mat const &)" (??0Mat@cv@@QAE@ABV01@@Z)
1>ExNiJoints.obj : error LNK2019: unresolved external symbol "void __cdecl cv::fastFree(void *)" (?fastFree@cv@@YAXPAX@Z) referenced in function "public: __thiscall cv::Mat::~Mat(void)" (??1Mat@cv@@QAE@XZ)
1>ExNiJoints.obj : error LNK2019: unresolved external symbol "public: void __thiscall cv::Mat::deallocate(void)" (?deallocate@Mat@cv@@QAEXXZ) referenced in function "public: void __thiscall cv::Mat::release(void)" (?release@Mat@cv@@QAEXXZ)
1>ExNiJoints.obj : error LNK2019: unresolved external symbol "public: virtual __thiscall cv::Exception::~Exception(void)" (??1Exception@cv@@UAE@XZ) referenced in function "public: class cv::Size_<int> __thiscall cv::Mat::MSize::operator()(void)const " (??RMSize@Mat@cv@@QBE?AV?$Size_@H@2@XZ)
1>ExNiJoints.obj : error LNK2019: unresolved external symbol "void __cdecl cv::error(class cv::Exception const &)" (?error@cv@@YAXABVException@1@@Z) referenced in function "public: class cv::Size_<int> __thiscall cv::Mat::MSize::operator()(void)const " (??RMSize@Mat@cv@@QBE?AV?$Size_@H@2@XZ)
1>ExNiJoints.obj : error LNK2019: unresolved external symbol "public: __thiscall cv::Exception::Exception(int,class std::basic_string<char,struct std::char_traits<char>,class std::allocator<char> > const &,class std::basic_string<char,struct std::char_traits<char>,class std::allocator<char> > const &,class std::basic_string<char,struct std::char_traits<char>,class std::allocator<char> > const &,int)" (??0Exception@cv@@QAE@HABV?$basic_string@DU?$char_traits@D@std@@V?$allocator@D@2@@std@@00H@Z) referenced in function "public: class cv::Size_<int> __thiscall cv::Mat::MSize::operator()(void)const " (??RMSize@Mat@cv@@QBE?AV?$Size_@H@2@XZ)
1>ExNiJoints.obj : error LNK2019: unresolved external symbol "public: void __thiscall cv::Ptr<struct CvHaarClassifierCascade>::delete_obj(void)" (?delete_obj@?$Ptr@UCvHaarClassifierCascade@@@cv@@QAEXXZ) referenced in function "public: void __thiscall cv::Ptr<struct CvHaarClassifierCascade>::release(void)" (?release@?$Ptr@UCvHaarClassifierCascade@@@cv@@QAEXXZ)
1>ExNiJoints.obj : error LNK2019: unresolved external symbol "public: void __thiscall cv::Mat::create(int,int const *,int)" (?create@Mat@cv@@QAEXHPBHH@Z) referenced in function "public: void __thiscall cv::Mat::create(int,int,int)" (?create@Mat@cv@@QAEXHHH@Z)
1>JunkBox_Win_Lib.lib(OpenNiWin.obj) : error LNK2019: unresolved external symbol __imp__niteStopSkeletonTracking referenced in function "public: void __thiscall nite::UserTracker::stopSkeletonTracking(short)" (?stopSkeletonTracking@UserTracker@nite@@QAEXF@Z)
1>JunkBox_Win_Lib.lib(OpenNiWin.obj) : error LNK2019: unresolved external symbol __imp__niteConvertJointCoordinatesToDepth referenced in function "public: enum nite::Status __thiscall nite::UserTracker::convertJointCoordinatesToDepth(float,float,float,float *,float *)const " (?convertJointCoordinatesToDepth@UserTracker@nite@@QBE?AW4Status@2@MMMPAM0@Z)
1>JunkBox_Lib++.lib(OpenNi2Tool.obj) : error LNK2019: unresolved external symbol __imp__niteStartSkeletonTracking referenced in function "public: enum nite::Status __thiscall nite::UserTracker::startSkeletonTracking(short)" (?startSkeletonTracking@UserTracker@nite@@QAE?AW4Status@2@F@Z)
1>JunkBox_Lib++.lib(OpenNi2Device.obj) : error LNK2019: unresolved external symbol __imp__niteUserTrackerFrameRelease referenced in function "public: void __thiscall nite::UserTrackerFrameRef::release(void)" (?release@UserTrackerFrameRef@nite@@QAEXXZ)
1>JunkBox_Lib++.lib(OpenNi2Device.obj) : error LNK2019: unresolved external symbol __imp__niteInitializeUserTrackerByDevice referenced in function "public: enum nite::Status __thiscall nite::UserTracker::create(class openni::Device *)" (?create@UserTracker@nite@@QAE?AW4Status@2@PAVDevice@openni@@@Z)
1>JunkBox_Lib++.lib(OpenNi2Device.obj) : error LNK2019: unresolved external symbol __imp__niteInitializeUserTracker referenced in function "public: enum nite::Status __thiscall nite::UserTracker::create(class openni::Device *)" (?create@UserTracker@nite@@QAE?AW4Status@2@PAVDevice@openni@@@Z)
1>JunkBox_Lib++.lib(OpenNi2Device.obj) : error LNK2019: unresolved external symbol __imp__niteShutdownUserTracker referenced in function "public: void __thiscall nite::UserTracker::destroy(void)" (?destroy@UserTracker@nite@@QAEXXZ)
1>JunkBox_Lib++.lib(OpenNi2Device.obj) : error LNK2019: unresolved external symbol __imp__niteSetSkeletonSmoothing referenced in function "public: enum nite::Status __thiscall nite::UserTracker::setSkeletonSmoothingFactor(float)" (?setSkeletonSmoothingFactor@UserTracker@nite@@QAE?AW4Status@2@M@Z)
1>JunkBox_Lib++.lib(OpenNi2Device.obj) : error LNK2019: unresolved external symbol __imp__niteReadUserTrackerFrame referenced in function "public: enum nite::Status __thiscall nite::UserTracker::readFrame(class nite::UserTrackerFrameRef *)" (?readFrame@UserTracker@nite@@QAE?AW4Status@2@PAVUserTrackerFrameRef@2@@Z)
1>JunkBox_Lib++.lib(OpenNi2Device.obj) : error LNK2019: unresolved external symbol __imp__niteInitialize referenced in function "public: static enum nite::Status __cdecl nite::NiTE::initialize(void)" (?initialize@NiTE@nite@@SA?AW4Status@2@XZ)
1>JunkBox_Lib++.lib(OpenNi2Device.obj) : error LNK2019: unresolved external symbol __imp__niteShutdown referenced in function "public: static void __cdecl nite::NiTE::shutdown(void)" (?shutdown@NiTE@nite@@SAXXZ)
1>C:\Users\Media Markt\Documents\Visual Studio 2010\Projects\Rinions\Rinions-3.4\Debug\Rinions.exe : fatal error LNK1120: 34 unresolved externals
1>
1>Build FAILED.
1>
1>Time Elapsed 00:02:55.97
========== Rebuild All: 0 succeeded, 1 failed, 0 skipped ==========
投票数:91 平均点:7.47
前の投稿 - 次の投稿 | 親投稿 - 子投稿なし | 投稿日時 2013-7-11 22:42 | 最終変更
iseki  Home away from home   投稿数: 1381
Hi,

>> c:\users\media markt\documents\visual studio 2010\projects\rinions\junkbox_lib++\graphlib\gio.h(449): warning C4129: '' :
>> unrecognized character escape sequence

Sorry, I use Japanese in source code. I corrected it.
However, this is not important.


Important problems are the following messages.

>> NiTE2.lib : warning LNK4003: invalid library format; library ignored
>> opencv_core242d.lib : warning LNK4003: invalid library format; library ignored
>> opencv_xxxxxx .....

This means that those libraries are broken. (or not match current OS or not match x86/x64)
What version of NITE2/OpenCV do you use?

If you use only Kinect SDK, you can disable OpenNI/NiTE and OpenCV.
When you do not have xtion, I think that OpenNI/NiTE is unnecessary.

1. Update Rinions source code by subversion.
2. Executs VS2010
3. Open property of project of VS2010. and open C/C++ -> Priprocesor -> define of priprocessor
4. delete "ENABLE_OPENNI2" and "ENABLE_OPENCV"
5. Build Ribions
投票数:44 平均点:4.55
前の投稿 - 次の投稿 | 親投稿 - 子投稿なし | 投稿日時 2013-7-12 19:41
fcassola  Not too shy to talk 居住地: Porto :: Portugal  投稿数: 24
Hello Iseki, sorry for the inconvinience, but im getting desperate ...
after doing all you've been told me, i get a lot of errors, as you can see.

Thanks, all the help will be welcome a lot!

1>------ Build started: Project: Rinions, Configuration: Debug Win32 ------
1>Build started 12/07/2013 11:34:06.
1>InitializeBuildStatus:
1> Touching "Debug\Rinions.unsuccessfulbuild".
1>ClCompile:
1> All outputs are up-to-date.
1> SensorFrame.cpp
1>c:\users\media markt\documents\visual studio 2010\projects\rinions_vs10\extend library\winnilib\kinectwin.h(39): error C2143: syntax error : missing ';' before '*'
1>c:\users\media markt\documents\visual studio 2010\projects\rinions_vs10\extend library\winnilib\kinectwin.h(39): error C4430: missing type specifier - int assumed. Note: C++ does not support default-int
1>c:\users\media markt\documents\visual studio 2010\projects\rinions_vs10\extend library\winnilib\kinectwin.h(39): error C4430: missing type specifier - int assumed. Note: C++ does not support default-int
1>c:\users\media markt\documents\visual studio 2010\projects\rinions_vs10\extend library\winnilib\kinectwin.h(158): error C2143: syntax error : missing ';' before '*'
1>c:\users\media markt\documents\visual studio 2010\projects\rinions_vs10\extend library\winnilib\kinectwin.h(158): error C2433: 'jbxwl::CKinectWin::CNiSpeech' : 'virtual' not permitted on data declarations
1>c:\users\media markt\documents\visual studio 2010\projects\rinions_vs10\extend library\winnilib\kinectwin.h(158): error C4430: missing type specifier - int assumed. Note: C++ does not support default-int
1>c:\users\media markt\documents\visual studio 2010\projects\rinions_vs10\extend library\winnilib\kinectwin.h(158): error C4430: missing type specifier - int assumed. Note: C++ does not support default-int
1>c:\users\media markt\documents\visual studio 2010\projects\rinions_vs10\extend library\winnilib\kinectwin.h(158): warning C4183: 'makeSpeech': missing return type; assumed to be a member function returning 'int'
1>c:\users\media markt\documents\visual studio 2010\projects\rinions_vs10\extend library\winnilib\kinectwin.h(156): error C2065: 'speech' : undeclared identifier
1>c:\users\media markt\documents\visual studio 2010\projects\rinions_vs10\extend library\winnilib\kinectwin.h(156): error C2065: 'speech' : undeclared identifier
1>c:\users\media markt\documents\visual studio 2010\projects\rinions_vs10\extend library\winnilib\kinectwin.h(156): error C2227: left of '->setConfidence' must point to class/struct/union/generic type
1> type is ''unknown-type''
1>c:\users\media markt\documents\visual studio 2010\projects\rinions_vs10\extend library\winnilib\kinectwin.h(158): error C2065: 'CNiSpeech' : undeclared identifier
1>c:\users\media markt\documents\visual studio 2010\projects\rinions_vs10\extend library\winnilib\kinectwin.h(158): error C2065: 'spch' : undeclared identifier
1>c:\users\media markt\documents\visual studio 2010\projects\rinions_vs10\extend library\winnilib\kinectwin.h(158): error C2061: syntax error : identifier 'CNiSpeech'
1>c:\users\media markt\documents\visual studio 2010\projects\rinions_vs10\extend library\winnilib\kinectwin.h(158): error C2065: 'spch' : undeclared identifier
1>c:\users\media markt\documents\visual studio 2010\projects\rinions_vs10\extend library\winnilib\nifiletool.h(44): warning C4010: single-line comment contains line-continuation character
1> Rinions.cpp
1>c:\users\media markt\documents\visual studio 2010\projects\rinions_vs10\extend library\winnilib\kinectwin.h(39): error C2143: syntax error : missing ';' before '*'
1>c:\users\media markt\documents\visual studio 2010\projects\rinions_vs10\extend library\winnilib\kinectwin.h(39): error C4430: missing type specifier - int assumed. Note: C++ does not support default-int
1>c:\users\media markt\documents\visual studio 2010\projects\rinions_vs10\extend library\winnilib\kinectwin.h(39): error C4430: missing type specifier - int assumed. Note: C++ does not support default-int
1>c:\users\media markt\documents\visual studio 2010\projects\rinions_vs10\extend library\winnilib\kinectwin.h(158): error C2143: syntax error : missing ';' before '*'
1>c:\users\media markt\documents\visual studio 2010\projects\rinions_vs10\extend library\winnilib\kinectwin.h(158): error C2433: 'jbxwl::CKinectWin::CNiSpeech' : 'virtual' not permitted on data declarations
1>c:\users\media markt\documents\visual studio 2010\projects\rinions_vs10\extend library\winnilib\kinectwin.h(158): error C4430: missing type specifier - int assumed. Note: C++ does not support default-int
1>c:\users\media markt\documents\visual studio 2010\projects\rinions_vs10\extend library\winnilib\kinectwin.h(158): error C4430: missing type specifier - int assumed. Note: C++ does not support default-int
1>c:\users\media markt\documents\visual studio 2010\projects\rinions_vs10\extend library\winnilib\kinectwin.h(158): warning C4183: 'makeSpeech': missing return type; assumed to be a member function returning 'int'
1>c:\users\media markt\documents\visual studio 2010\projects\rinions_vs10\extend library\winnilib\kinectwin.h(156): error C2065: 'speech' : undeclared identifier
1>c:\users\media markt\documents\visual studio 2010\projects\rinions_vs10\extend library\winnilib\kinectwin.h(156): error C2065: 'speech' : undeclared identifier
1>c:\users\media markt\documents\visual studio 2010\projects\rinions_vs10\extend library\winnilib\kinectwin.h(156): error C2227: left of '->setConfidence' must point to class/struct/union/generic type
1> type is ''unknown-type''
1>c:\users\media markt\documents\visual studio 2010\projects\rinions_vs10\extend library\winnilib\kinectwin.h(158): error C2065: 'CNiSpeech' : undeclared identifier
1>c:\users\media markt\documents\visual studio 2010\projects\rinions_vs10\extend library\winnilib\kinectwin.h(158): error C2065: 'spch' : undeclared identifier
1>c:\users\media markt\documents\visual studio 2010\projects\rinions_vs10\extend library\winnilib\kinectwin.h(158): error C2061: syntax error : identifier 'CNiSpeech'
1>c:\users\media markt\documents\visual studio 2010\projects\rinions_vs10\extend library\winnilib\kinectwin.h(158): error C2065: 'spch' : undeclared identifier
1>c:\users\media markt\documents\visual studio 2010\projects\rinions_vs10\extend library\winnilib\nifiletool.h(44): warning C4010: single-line comment contains line-continuation character
1> MainFrm.cpp
1>c:\users\media markt\documents\visual studio 2010\projects\rinions_vs10\extend library\winnilib\kinectwin.h(39): error C2143: syntax error : missing ';' before '*'
1>c:\users\media markt\documents\visual studio 2010\projects\rinions_vs10\extend library\winnilib\kinectwin.h(39): error C4430: missing type specifier - int assumed. Note: C++ does not support default-int
1>c:\users\media markt\documents\visual studio 2010\projects\rinions_vs10\extend library\winnilib\kinectwin.h(39): error C4430: missing type specifier - int assumed. Note: C++ does not support default-int
1>c:\users\media markt\documents\visual studio 2010\projects\rinions_vs10\extend library\winnilib\kinectwin.h(158): error C2143: syntax error : missing ';' before '*'
1>c:\users\media markt\documents\visual studio 2010\projects\rinions_vs10\extend library\winnilib\kinectwin.h(158): error C2433: 'jbxwl::CKinectWin::CNiSpeech' : 'virtual' not permitted on data declarations
1>c:\users\media markt\documents\visual studio 2010\projects\rinions_vs10\extend library\winnilib\kinectwin.h(158): error C4430: missing type specifier - int assumed. Note: C++ does not support default-int
1>c:\users\media markt\documents\visual studio 2010\projects\rinions_vs10\extend library\winnilib\kinectwin.h(158): error C4430: missing type specifier - int assumed. Note: C++ does not support default-int
1>c:\users\media markt\documents\visual studio 2010\projects\rinions_vs10\extend library\winnilib\kinectwin.h(158): warning C4183: 'makeSpeech': missing return type; assumed to be a member function returning 'int'
1>c:\users\media markt\documents\visual studio 2010\projects\rinions_vs10\extend library\winnilib\kinectwin.h(156): error C2065: 'speech' : undeclared identifier
1>c:\users\media markt\documents\visual studio 2010\projects\rinions_vs10\extend library\winnilib\kinectwin.h(156): error C2065: 'speech' : undeclared identifier
1>c:\users\media markt\documents\visual studio 2010\projects\rinions_vs10\extend library\winnilib\kinectwin.h(156): error C2227: left of '->setConfidence' must point to class/struct/union/generic type
1> type is ''unknown-type''
1>c:\users\media markt\documents\visual studio 2010\projects\rinions_vs10\extend library\winnilib\kinectwin.h(158): error C2065: 'CNiSpeech' : undeclared identifier
1>c:\users\media markt\documents\visual studio 2010\projects\rinions_vs10\extend library\winnilib\kinectwin.h(158): error C2065: 'spch' : undeclared identifier
1>c:\users\media markt\documents\visual studio 2010\projects\rinions_vs10\extend library\winnilib\kinectwin.h(158): error C2061: syntax error : identifier 'CNiSpeech'
1>c:\users\media markt\documents\visual studio 2010\projects\rinions_vs10\extend library\winnilib\kinectwin.h(158): error C2065: 'spch' : undeclared identifier
1>c:\users\media markt\documents\visual studio 2010\projects\rinions_vs10\extend library\winnilib\nifiletool.h(44): warning C4010: single-line comment contains line-continuation character
1> ExNiDevice.cpp
1>c:\users\media markt\documents\visual studio 2010\projects\rinions_vs10\extend library\winnilib\kinectwin.h(39): error C2143: syntax error : missing ';' before '*'
1>c:\users\media markt\documents\visual studio 2010\projects\rinions_vs10\extend library\winnilib\kinectwin.h(39): error C4430: missing type specifier - int assumed. Note: C++ does not support default-int
1>c:\users\media markt\documents\visual studio 2010\projects\rinions_vs10\extend library\winnilib\kinectwin.h(39): error C4430: missing type specifier - int assumed. Note: C++ does not support default-int
1>c:\users\media markt\documents\visual studio 2010\projects\rinions_vs10\extend library\winnilib\kinectwin.h(158): error C2143: syntax error : missing ';' before '*'
1>c:\users\media markt\documents\visual studio 2010\projects\rinions_vs10\extend library\winnilib\kinectwin.h(158): error C2433: 'jbxwl::CKinectWin::CNiSpeech' : 'virtual' not permitted on data declarations
1>c:\users\media markt\documents\visual studio 2010\projects\rinions_vs10\extend library\winnilib\kinectwin.h(158): error C4430: missing type specifier - int assumed. Note: C++ does not support default-int
1>c:\users\media markt\documents\visual studio 2010\projects\rinions_vs10\extend library\winnilib\kinectwin.h(158): error C4430: missing type specifier - int assumed. Note: C++ does not support default-int
1>c:\users\media markt\documents\visual studio 2010\projects\rinions_vs10\extend library\winnilib\kinectwin.h(158): warning C4183: 'makeSpeech': missing return type; assumed to be a member function returning 'int'
1>c:\users\media markt\documents\visual studio 2010\projects\rinions_vs10\extend library\winnilib\kinectwin.h(156): error C2065: 'speech' : undeclared identifier
1>c:\users\media markt\documents\visual studio 2010\projects\rinions_vs10\extend library\winnilib\kinectwin.h(156): error C2065: 'speech' : undeclared identifier
1>c:\users\media markt\documents\visual studio 2010\projects\rinions_vs10\extend library\winnilib\kinectwin.h(156): error C2227: left of '->setConfidence' must point to class/struct/union/generic type
1> type is ''unknown-type''
1>c:\users\media markt\documents\visual studio 2010\projects\rinions_vs10\extend library\winnilib\kinectwin.h(158): error C2065: 'CNiSpeech' : undeclared identifier
1>c:\users\media markt\documents\visual studio 2010\projects\rinions_vs10\extend library\winnilib\kinectwin.h(158): error C2065: 'spch' : undeclared identifier
1>c:\users\media markt\documents\visual studio 2010\projects\rinions_vs10\extend library\winnilib\kinectwin.h(158): error C2061: syntax error : identifier 'CNiSpeech'
1>c:\users\media markt\documents\visual studio 2010\projects\rinions_vs10\extend library\winnilib\kinectwin.h(158): error C2065: 'spch' : undeclared identifier
1>c:\users\media markt\documents\visual studio 2010\projects\rinions_vs10\extend library\winnilib\nifiletool.h(44): warning C4010: single-line comment contains line-continuation character
1>c:\users\media markt\documents\visual studio 2010\projects\rinions_vs10\exnilib\exnidevice.cpp(1845): error C2065: 'LNI_SPEECH_LANG_JP_KINECT' : undeclared identifier
1>c:\users\media markt\documents\visual studio 2010\projects\rinions_vs10\exnilib\exnidevice.cpp(1848): error C2065: 'LNI_SPEECH_LANG_US_KINECT' : undeclared identifier
1> ExKinectWin.cpp
1>c:\users\media markt\documents\visual studio 2010\projects\rinions_vs10\extend library\winnilib\kinectwin.h(39): error C2143: syntax error : missing ';' before '*'
1>c:\users\media markt\documents\visual studio 2010\projects\rinions_vs10\extend library\winnilib\kinectwin.h(39): error C4430: missing type specifier - int assumed. Note: C++ does not support default-int
1>c:\users\media markt\documents\visual studio 2010\projects\rinions_vs10\extend library\winnilib\kinectwin.h(39): error C4430: missing type specifier - int assumed. Note: C++ does not support default-int
1>c:\users\media markt\documents\visual studio 2010\projects\rinions_vs10\extend library\winnilib\kinectwin.h(158): error C2143: syntax error : missing ';' before '*'
1>c:\users\media markt\documents\visual studio 2010\projects\rinions_vs10\extend library\winnilib\kinectwin.h(158): error C2433: 'jbxwl::CKinectWin::CNiSpeech' : 'virtual' not permitted on data declarations
1>c:\users\media markt\documents\visual studio 2010\projects\rinions_vs10\extend library\winnilib\kinectwin.h(158): error C4430: missing type specifier - int assumed. Note: C++ does not support default-int
1>c:\users\media markt\documents\visual studio 2010\projects\rinions_vs10\extend library\winnilib\kinectwin.h(158): error C4430: missing type specifier - int assumed. Note: C++ does not support default-int
1>c:\users\media markt\documents\visual studio 2010\projects\rinions_vs10\extend library\winnilib\kinectwin.h(158): warning C4183: 'makeSpeech': missing return type; assumed to be a member function returning 'int'
1>c:\users\media markt\documents\visual studio 2010\projects\rinions_vs10\extend library\winnilib\kinectwin.h(156): error C2065: 'speech' : undeclared identifier
1>c:\users\media markt\documents\visual studio 2010\projects\rinions_vs10\extend library\winnilib\kinectwin.h(156): error C2065: 'speech' : undeclared identifier
1>c:\users\media markt\documents\visual studio 2010\projects\rinions_vs10\extend library\winnilib\kinectwin.h(156): error C2227: left of '->setConfidence' must point to class/struct/union/generic type
1> type is ''unknown-type''
1>c:\users\media markt\documents\visual studio 2010\projects\rinions_vs10\extend library\winnilib\kinectwin.h(158): error C2065: 'CNiSpeech' : undeclared identifier
1>c:\users\media markt\documents\visual studio 2010\projects\rinions_vs10\extend library\winnilib\kinectwin.h(158): error C2065: 'spch' : undeclared identifier
1>c:\users\media markt\documents\visual studio 2010\projects\rinions_vs10\extend library\winnilib\kinectwin.h(158): error C2061: syntax error : identifier 'CNiSpeech'
1>c:\users\media markt\documents\visual studio 2010\projects\rinions_vs10\extend library\winnilib\kinectwin.h(158): error C2065: 'spch' : undeclared identifier
1>c:\users\media markt\documents\visual studio 2010\projects\rinions_vs10\extend library\winnilib\nifiletool.h(44): warning C4010: single-line comment contains line-continuation character
1>c1xx : fatal error C1903: unable to recover from previous error(s); stopping compilation
1> SetDevice.cpp
1>c:\users\media markt\documents\visual studio 2010\projects\rinions_vs10\extend library\winnilib\kinectwin.h(39): error C2143: syntax error : missing ';' before '*'
1>c:\users\media markt\documents\visual studio 2010\projects\rinions_vs10\extend library\winnilib\kinectwin.h(39): error C4430: missing type specifier - int assumed. Note: C++ does not support default-int
1>c:\users\media markt\documents\visual studio 2010\projects\rinions_vs10\extend library\winnilib\kinectwin.h(39): error C4430: missing type specifier - int assumed. Note: C++ does not support default-int
1>c:\users\media markt\documents\visual studio 2010\projects\rinions_vs10\extend library\winnilib\kinectwin.h(158): error C2143: syntax error : missing ';' before '*'
1>c:\users\media markt\documents\visual studio 2010\projects\rinions_vs10\extend library\winnilib\kinectwin.h(158): error C2433: 'jbxwl::CKinectWin::CNiSpeech' : 'virtual' not permitted on data declarations
1>c:\users\media markt\documents\visual studio 2010\projects\rinions_vs10\extend library\winnilib\kinectwin.h(158): error C4430: missing type specifier - int assumed. Note: C++ does not support default-int
1>c:\users\media markt\documents\visual studio 2010\projects\rinions_vs10\extend library\winnilib\kinectwin.h(158): error C4430: missing type specifier - int assumed. Note: C++ does not support default-int
1>c:\users\media markt\documents\visual studio 2010\projects\rinions_vs10\extend library\winnilib\kinectwin.h(158): warning C4183: 'makeSpeech': missing return type; assumed to be a member function returning 'int'
1>c:\users\media markt\documents\visual studio 2010\projects\rinions_vs10\extend library\winnilib\kinectwin.h(156): error C2065: 'speech' : undeclared identifier
1>c:\users\media markt\documents\visual studio 2010\projects\rinions_vs10\extend library\winnilib\kinectwin.h(156): error C2065: 'speech' : undeclared identifier
1>c:\users\media markt\documents\visual studio 2010\projects\rinions_vs10\extend library\winnilib\kinectwin.h(156): error C2227: left of '->setConfidence' must point to class/struct/union/generic type
1> type is ''unknown-type''
1>c:\users\media markt\documents\visual studio 2010\projects\rinions_vs10\extend library\winnilib\kinectwin.h(158): error C2065: 'CNiSpeech' : undeclared identifier
1>c:\users\media markt\documents\visual studio 2010\projects\rinions_vs10\extend library\winnilib\kinectwin.h(158): error C2065: 'spch' : undeclared identifier
1>c:\users\media markt\documents\visual studio 2010\projects\rinions_vs10\extend library\winnilib\kinectwin.h(158): error C2061: syntax error : identifier 'CNiSpeech'
1>c:\users\media markt\documents\visual studio 2010\projects\rinions_vs10\extend library\winnilib\kinectwin.h(158): error C2065: 'spch' : undeclared identifier
1>c:\users\media markt\documents\visual studio 2010\projects\rinions_vs10\extend library\winnilib\nifiletool.h(44): warning C4010: single-line comment contains line-continuation character
1> SetDataSave.cpp
1>c:\users\media markt\documents\visual studio 2010\projects\rinions_vs10\extend library\winnilib\kinectwin.h(39): error C2143: syntax error : missing ';' before '*'
1>c:\users\media markt\documents\visual studio 2010\projects\rinions_vs10\extend library\winnilib\kinectwin.h(39): error C4430: missing type specifier - int assumed. Note: C++ does not support default-int
1>c:\users\media markt\documents\visual studio 2010\projects\rinions_vs10\extend library\winnilib\kinectwin.h(39): error C4430: missing type specifier - int assumed. Note: C++ does not support default-int
1>c:\users\media markt\documents\visual studio 2010\projects\rinions_vs10\extend library\winnilib\kinectwin.h(158): error C2143: syntax error : missing ';' before '*'
1>c:\users\media markt\documents\visual studio 2010\projects\rinions_vs10\extend library\winnilib\kinectwin.h(158): error C2433: 'jbxwl::CKinectWin::CNiSpeech' : 'virtual' not permitted on data declarations
1>c:\users\media markt\documents\visual studio 2010\projects\rinions_vs10\extend library\winnilib\kinectwin.h(158): error C4430: missing type specifier - int assumed. Note: C++ does not support default-int
1>c:\users\media markt\documents\visual studio 2010\projects\rinions_vs10\extend library\winnilib\kinectwin.h(158): error C4430: missing type specifier - int assumed. Note: C++ does not support default-int
1>c:\users\media markt\documents\visual studio 2010\projects\rinions_vs10\extend library\winnilib\kinectwin.h(158): warning C4183: 'makeSpeech': missing return type; assumed to be a member function returning 'int'
1>c:\users\media markt\documents\visual studio 2010\projects\rinions_vs10\extend library\winnilib\kinectwin.h(156): error C2065: 'speech' : undeclared identifier
1>c:\users\media markt\documents\visual studio 2010\projects\rinions_vs10\extend library\winnilib\kinectwin.h(156): error C2065: 'speech' : undeclared identifier
1>c:\users\media markt\documents\visual studio 2010\projects\rinions_vs10\extend library\winnilib\kinectwin.h(156): error C2227: left of '->setConfidence' must point to class/struct/union/generic type
1> type is ''unknown-type''
1>c:\users\media markt\documents\visual studio 2010\projects\rinions_vs10\extend library\winnilib\kinectwin.h(158): error C2065: 'CNiSpeech' : undeclared identifier
1>c:\users\media markt\documents\visual studio 2010\projects\rinions_vs10\extend library\winnilib\kinectwin.h(158): error C2065: 'spch' : undeclared identifier
1>c:\users\media markt\documents\visual studio 2010\projects\rinions_vs10\extend library\winnilib\kinectwin.h(158): error C2061: syntax error : identifier 'CNiSpeech'
1>c:\users\media markt\documents\visual studio 2010\projects\rinions_vs10\extend library\winnilib\kinectwin.h(158): error C2065: 'spch' : undeclared identifier
1>c:\users\media markt\documents\visual studio 2010\projects\rinions_vs10\extend library\winnilib\nifiletool.h(44): warning C4010: single-line comment contains line-continuation character
1> SetAnimation.cpp
1>c:\users\media markt\documents\visual studio 2010\projects\rinions_vs10\extend library\winnilib\kinectwin.h(39): error C2143: syntax error : missing ';' before '*'
1>c:\users\media markt\documents\visual studio 2010\projects\rinions_vs10\extend library\winnilib\kinectwin.h(39): error C4430: missing type specifier - int assumed. Note: C++ does not support default-int
1>c:\users\media markt\documents\visual studio 2010\projects\rinions_vs10\extend library\winnilib\kinectwin.h(39): error C4430: missing type specifier - int assumed. Note: C++ does not support default-int
1>c:\users\media markt\documents\visual studio 2010\projects\rinions_vs10\extend library\winnilib\kinectwin.h(158): error C2143: syntax error : missing ';' before '*'
1>c:\users\media markt\documents\visual studio 2010\projects\rinions_vs10\extend library\winnilib\kinectwin.h(158): error C2433: 'jbxwl::CKinectWin::CNiSpeech' : 'virtual' not permitted on data declarations
1>c:\users\media markt\documents\visual studio 2010\projects\rinions_vs10\extend library\winnilib\kinectwin.h(158): error C4430: missing type specifier - int assumed. Note: C++ does not support default-int
1>c:\users\media markt\documents\visual studio 2010\projects\rinions_vs10\extend library\winnilib\kinectwin.h(158): error C4430: missing type specifier - int assumed. Note: C++ does not support default-int
1>c:\users\media markt\documents\visual studio 2010\projects\rinions_vs10\extend library\winnilib\kinectwin.h(158): warning C4183: 'makeSpeech': missing return type; assumed to be a member function returning 'int'
1>c:\users\media markt\documents\visual studio 2010\projects\rinions_vs10\extend library\winnilib\kinectwin.h(156): error C2065: 'speech' : undeclared identifier
1>c:\users\media markt\documents\visual studio 2010\projects\rinions_vs10\extend library\winnilib\kinectwin.h(156): error C2065: 'speech' : undeclared identifier
1>c:\users\media markt\documents\visual studio 2010\projects\rinions_vs10\extend library\winnilib\kinectwin.h(156): error C2227: left of '->setConfidence' must point to class/struct/union/generic type
1> type is ''unknown-type''
1>c:\users\media markt\documents\visual studio 2010\projects\rinions_vs10\extend library\winnilib\kinectwin.h(158): error C2065: 'CNiSpeech' : undeclared identifier
1>c:\users\media markt\documents\visual studio 2010\projects\rinions_vs10\extend library\winnilib\kinectwin.h(158): error C2065: 'spch' : undeclared identifier
1>c:\users\media markt\documents\visual studio 2010\projects\rinions_vs10\extend library\winnilib\kinectwin.h(158): error C2061: syntax error : identifier 'CNiSpeech'
1>c:\users\media markt\documents\visual studio 2010\projects\rinions_vs10\extend library\winnilib\kinectwin.h(158): error C2065: 'spch' : undeclared identifier
1>c:\users\media markt\documents\visual studio 2010\projects\rinions_vs10\extend library\winnilib\nifiletool.h(44): warning C4010: single-line comment contains line-continuation character
1> FilePlayerDLG.cpp
1>c:\users\media markt\documents\visual studio 2010\projects\rinions_vs10\extend library\winnilib\kinectwin.h(39): error C2143: syntax error : missing ';' before '*'
1>c:\users\media markt\documents\visual studio 2010\projects\rinions_vs10\extend library\winnilib\kinectwin.h(39): error C4430: missing type specifier - int assumed. Note: C++ does not support default-int
1>c:\users\media markt\documents\visual studio 2010\projects\rinions_vs10\extend library\winnilib\kinectwin.h(39): error C4430: missing type specifier - int assumed. Note: C++ does not support default-int
1>c:\users\media markt\documents\visual studio 2010\projects\rinions_vs10\extend library\winnilib\kinectwin.h(158): error C2143: syntax error : missing ';' before '*'
1>c:\users\media markt\documents\visual studio 2010\projects\rinions_vs10\extend library\winnilib\kinectwin.h(158): error C2433: 'jbxwl::CKinectWin::CNiSpeech' : 'virtual' not permitted on data declarations
1>c:\users\media markt\documents\visual studio 2010\projects\rinions_vs10\extend library\winnilib\kinectwin.h(158): error C4430: missing type specifier - int assumed. Note: C++ does not support default-int
1>c:\users\media markt\documents\visual studio 2010\projects\rinions_vs10\extend library\winnilib\kinectwin.h(158): error C4430: missing type specifier - int assumed. Note: C++ does not support default-int
1>c:\users\media markt\documents\visual studio 2010\projects\rinions_vs10\extend library\winnilib\kinectwin.h(158): warning C4183: 'makeSpeech': missing return type; assumed to be a member function returning 'int'
1>c:\users\media markt\documents\visual studio 2010\projects\rinions_vs10\extend library\winnilib\kinectwin.h(156): error C2065: 'speech' : undeclared identifier
1>c:\users\media markt\documents\visual studio 2010\projects\rinions_vs10\extend library\winnilib\kinectwin.h(156): error C2065: 'speech' : undeclared identifier
1>c:\users\media markt\documents\visual studio 2010\projects\rinions_vs10\extend library\winnilib\kinectwin.h(156): error C2227: left of '->setConfidence' must point to class/struct/union/generic type
1> type is ''unknown-type''
1>c:\users\media markt\documents\visual studio 2010\projects\rinions_vs10\extend library\winnilib\kinectwin.h(158): error C2065: 'CNiSpeech' : undeclared identifier
1>c:\users\media markt\documents\visual studio 2010\projects\rinions_vs10\extend library\winnilib\kinectwin.h(158): error C2065: 'spch' : undeclared identifier
1>c:\users\media markt\documents\visual studio 2010\projects\rinions_vs10\extend library\winnilib\kinectwin.h(158): error C2061: syntax error : identifier 'CNiSpeech'
1>c:\users\media markt\documents\visual studio 2010\projects\rinions_vs10\extend library\winnilib\kinectwin.h(158): error C2065: 'spch' : undeclared identifier
1>c:\users\media markt\documents\visual studio 2010\projects\rinions_vs10\extend library\winnilib\nifiletool.h(44): warning C4010: single-line comment contains line-continuation character
1> DepthFrame.cpp
1>c:\users\media markt\documents\visual studio 2010\projects\rinions_vs10\extend library\winnilib\kinectwin.h(39): error C2143: syntax error : missing ';' before '*'
1>c:\users\media markt\documents\visual studio 2010\projects\rinions_vs10\extend library\winnilib\kinectwin.h(39): error C4430: missing type specifier - int assumed. Note: C++ does not support default-int
1>c:\users\media markt\documents\visual studio 2010\projects\rinions_vs10\extend library\winnilib\kinectwin.h(39): error C4430: missing type specifier - int assumed. Note: C++ does not support default-int
1>c:\users\media markt\documents\visual studio 2010\projects\rinions_vs10\extend library\winnilib\kinectwin.h(158): error C2143: syntax error : missing ';' before '*'
1>c:\users\media markt\documents\visual studio 2010\projects\rinions_vs10\extend library\winnilib\kinectwin.h(158): error C2433: 'jbxwl::CKinectWin::CNiSpeech' : 'virtual' not permitted on data declarations
1>c:\users\media markt\documents\visual studio 2010\projects\rinions_vs10\extend library\winnilib\kinectwin.h(158): error C4430: missing type specifier - int assumed. Note: C++ does not support default-int
1>c:\users\media markt\documents\visual studio 2010\projects\rinions_vs10\extend library\winnilib\kinectwin.h(158): error C4430: missing type specifier - int assumed. Note: C++ does not support default-int
1>c:\users\media markt\documents\visual studio 2010\projects\rinions_vs10\extend library\winnilib\kinectwin.h(158): warning C4183: 'makeSpeech': missing return type; assumed to be a member function returning 'int'
1>c:\users\media markt\documents\visual studio 2010\projects\rinions_vs10\extend library\winnilib\kinectwin.h(156): error C2065: 'speech' : undeclared identifier
1>c:\users\media markt\documents\visual studio 2010\projects\rinions_vs10\extend library\winnilib\kinectwin.h(156): error C2065: 'speech' : undeclared identifier
1>c:\users\media markt\documents\visual studio 2010\projects\rinions_vs10\extend library\winnilib\kinectwin.h(156): error C2227: left of '->setConfidence' must point to class/struct/union/generic type
1> type is ''unknown-type''
1>c:\users\media markt\documents\visual studio 2010\projects\rinions_vs10\extend library\winnilib\kinectwin.h(158): error C2065: 'CNiSpeech' : undeclared identifier
1>c:\users\media markt\documents\visual studio 2010\projects\rinions_vs10\extend library\winnilib\kinectwin.h(158): error C2065: 'spch' : undeclared identifier
1>c:\users\media markt\documents\visual studio 2010\projects\rinions_vs10\extend library\winnilib\kinectwin.h(158): error C2061: syntax error : identifier 'CNiSpeech'
1>c:\users\media markt\documents\visual studio 2010\projects\rinions_vs10\extend library\winnilib\kinectwin.h(158): error C2065: 'spch' : undeclared identifier
1>c:\users\media markt\documents\visual studio 2010\projects\rinions_vs10\extend library\winnilib\nifiletool.h(44): warning C4010: single-line comment contains line-continuation character
1> CameraView.cpp
1>c:\users\media markt\documents\visual studio 2010\projects\rinions_vs10\extend library\winnilib\kinectwin.h(39): error C2143: syntax error : missing ';' before '*'
1>c:\users\media markt\documents\visual studio 2010\projects\rinions_vs10\extend library\winnilib\kinectwin.h(39): error C4430: missing type specifier - int assumed. Note: C++ does not support default-int
1>c:\users\media markt\documents\visual studio 2010\projects\rinions_vs10\extend library\winnilib\kinectwin.h(39): error C4430: missing type specifier - int assumed. Note: C++ does not support default-int
1>c:\users\media markt\documents\visual studio 2010\projects\rinions_vs10\extend library\winnilib\kinectwin.h(158): error C2143: syntax error : missing ';' before '*'
1>c:\users\media markt\documents\visual studio 2010\projects\rinions_vs10\extend library\winnilib\kinectwin.h(158): error C2433: 'jbxwl::CKinectWin::CNiSpeech' : 'virtual' not permitted on data declarations
1>c:\users\media markt\documents\visual studio 2010\projects\rinions_vs10\extend library\winnilib\kinectwin.h(158): error C4430: missing type specifier - int assumed. Note: C++ does not support default-int
1>c:\users\media markt\documents\visual studio 2010\projects\rinions_vs10\extend library\winnilib\kinectwin.h(158): error C4430: missing type specifier - int assumed. Note: C++ does not support default-int
1>c:\users\media markt\documents\visual studio 2010\projects\rinions_vs10\extend library\winnilib\kinectwin.h(158): warning C4183: 'makeSpeech': missing return type; assumed to be a member function returning 'int'
1>c:\users\media markt\documents\visual studio 2010\projects\rinions_vs10\extend library\winnilib\kinectwin.h(156): error C2065: 'speech' : undeclared identifier
1>c:\users\media markt\documents\visual studio 2010\projects\rinions_vs10\extend library\winnilib\kinectwin.h(156): error C2065: 'speech' : undeclared identifier
1>c:\users\media markt\documents\visual studio 2010\projects\rinions_vs10\extend library\winnilib\kinectwin.h(156): error C2227: left of '->setConfidence' must point to class/struct/union/generic type
1> type is ''unknown-type''
1>c:\users\media markt\documents\visual studio 2010\projects\rinions_vs10\extend library\winnilib\kinectwin.h(158): error C2065: 'CNiSpeech' : undeclared identifier
1>c:\users\media markt\documents\visual studio 2010\projects\rinions_vs10\extend library\winnilib\kinectwin.h(158): error C2065: 'spch' : undeclared identifier
1>c:\users\media markt\documents\visual studio 2010\projects\rinions_vs10\extend library\winnilib\kinectwin.h(158): error C2061: syntax error : identifier 'CNiSpeech'
1>c:\users\media markt\documents\visual studio 2010\projects\rinions_vs10\extend library\winnilib\kinectwin.h(158): error C2065: 'spch' : undeclared identifier
1>c:\users\media markt\documents\visual studio 2010\projects\rinions_vs10\extend library\winnilib\nifiletool.h(44): warning C4010: single-line comment contains line-continuation character
1> Generating Code...
1> Compiling...
1> SetLogMode.cpp
1> Generating Code...
1> Compiling...
1> SetNetwork.cpp
1> Generating Code...
1> Compiling...
1> ExNiFileDev.cpp
1>c:\users\media markt\documents\visual studio 2010\projects\rinions_vs10\extend library\winnilib\nifiletool.h(44): warning C4010: single-line comment contains line-continuation character
1> Generating Code...
1> Compiling...
1> ExNiJoints.cpp
1> Generating Code...
1> Compiling...
1> ExNiSHMemory.cpp
1> Generating Code...
1> Skipping... (no relevant changes detected)
1> SetViewMode.cpp
1> SetSpeech.cpp
1> SetOutData.cpp
1> SetMotion.cpp
1> SHMJoints.cpp
1> SHMIF.cpp
1> ParameterSet.cpp
1> ExportNiData.cpp
1> ExNiNetwork.cpp
1>
1>Build FAILED.
1>
1>Time Elapsed 00:00:36.61
========== Build: 0 succeeded, 1 failed, 0 up-to-date, 0 skipped ==========
投票数:46 平均点:4.57
前の投稿 - 次の投稿 | 親投稿 - 子投稿なし | 投稿日時 2013-7-12 21:03
fcassola  Not too shy to talk 居住地: Porto :: Portugal  投稿数: 24
Sorry Iseki, when i delete the "ENABLE_OPENNI2" and "ENABLE_OPENCV" i still delete de ENABLE_NI_SPEECH entry, so this erros where natural (i've got to see the code to understand this errors).
After adding the ENABLE_NI_SPEECH again, it gave me this compilation errors ...
if you can help me, i appreciate a lot.
Thanks.

1>------ Build started: Project: Rinions, Configuration: Debug Win32 ------
1>Build started 12/07/2013 12:59:55.
1>InitializeBuildStatus:
1> Touching "Debug\Rinions.unsuccessfulbuild".
1>ClCompile:
1> All outputs are up-to-date.
1> All outputs are up-to-date.
1>ResourceCompile:
1> All outputs are up-to-date.
1>RC : fatal error RC1110: could not open ..\JunkBox_Win_Lib\WinLib.rc
1>
1>
1>Build FAILED.
1>
1>Time Elapsed 00:00:02.59
========== Build: 0 succeeded, 1 failed, 0 up-to-date, 0 skipped ==========
投票数:47 平均点:5.11
前の投稿 - 次の投稿 | 親投稿 - 子投稿.1 | 投稿日時 2013-7-12 21:30
fcassola  Not too shy to talk 居住地: Porto :: Portugal  投稿数: 24
Finally I managed to compile the code!
Thank you for all the great help you gave me!!!!

Now im going to debug trying to understand your source code to create new functions that can interact with my research PhD project ...

I keep you noticed ...

MANY THNKS ISEKI!!!

fernando cassola
投票数:42 平均点:4.29
前の投稿 - 次の投稿 | 親投稿 - 子投稿なし | 投稿日時 2013-7-12 23:44
iseki  Home away from home   投稿数: 1381
It was good.
投票数:71 平均点:7.18
前の投稿 - 次の投稿 | 親投稿 - 子投稿なし | 投稿日時 2016-3-31 19:52
selim  Just popping in   投稿数: 1
I would like to write "Hello World" in SL/OpenSim when I raise my hands.
As I learn, I need to write C++ on source code. Could you please help me about find the source code of rinions? Or another solution?

Best,
Selim.
投票数:26 平均点:5.38
前の投稿 - 次の投稿 | 親投稿 - 子投稿なし | 投稿日時 2016-3-31 22:51
iseki  Home away from home   投稿数: 1381
投票数:31 平均点:4.19

  条件検索へ


サイト内 検索

ログイン

ユーザー名:

パスワード:


パスワード紛失
新規登録

サブ メニュー

ミニカレンダー

前月2020年 3月翌月
1 2 3 4 5 6 7
8 9 10 11 12 13 14
15 16 17 18 19 20 21
22 23 24 25 26 27 28
29 30 31
<今日>

オンライン状況

103 人のユーザが現在オンラインです。 (1 人のユーザが Forum を参照しています。)

登録ユーザ: 0
ゲスト: 103

もっと...

アクセスカウンタ

今日 : 1875018750187501875018750
昨日 : 1610716107161071610716107
総計 : 1407944614079446140794461407944614079446140794461407944614079446
Powered by XOOPS Cube 2.1© 2001-2006 XOOPS Cube Project
Design by XoopsDesign.com